FailedConsole Output

13:25:34 Started by upstream project "Kbin_uX64__kinect2_registration__ubuntu_xenial_amd64__binary" build number 6
13:25:34 originally caused by:
13:25:34  Started by upstream project "Ksrc_uX__kinect2_registration__ubuntu_xenial__source" build number 6
13:25:34  originally caused by:
13:25:34   Started by upstream project "Krel_trigger-jobs" build number 38230
13:25:34   originally caused by:
13:25:34    Started by upstream project "Krel_reconfigure-jobs" build number 1490
13:25:34    originally caused by:
13:25:34     Started by user SYSTEM
13:25:34 Building remotely on build client 2 (slave buildslave indigo_devel_default) in workspace /home/jenkins-slave/workspace/Kbin_uX64__kinect2_bridge__ubuntu_xenial_amd64__binary
13:25:34 [ssh-agent] Looking for ssh-agent implementation...
13:25:34 [ssh-agent]   Exec ssh-agent (binary ssh-agent on a remote machine)
13:25:34 $ ssh-agent
13:25:34 SSH_AUTH_SOCK=/tmp/ssh-eAs1l1yEjWEy/agent.9169
13:25:34 SSH_AGENT_PID=9171
13:25:34 [ssh-agent] Started.
13:25:34 $ ssh-add /home/jenkins-slave/workspace/Kbin_uX64__kinect2_bridge__ubuntu_xenial_amd64__binary@tmp/private_key_4974233074158903459.key
13:25:34 Identity added: /home/jenkins-slave/workspace/Kbin_uX64__kinect2_bridge__ubuntu_xenial_amd64__binary@tmp/private_key_4974233074158903459.key (/home/jenkins-slave/workspace/Kbin_uX64__kinect2_bridge__ubuntu_xenial_amd64__binary@tmp/private_key_4974233074158903459.key)
13:25:34 [ssh-agent] Using credentials jenkins-slave
13:25:34 
1. Check upstream projects

Hide Details

13:25:34 # BEGIN SECTION: Check upstream projects 13:25:34 Verify that no recursive upstream project is broken: 13:25:34 - 'Kbin_uX64__kinect2_registration__ubuntu_xenial_amd64__binary' build '6' has result 'SUCCESS' 13:25:34 - 'Ksrc_uX__kinect2_registration__ubuntu_xenial__source' build '6' has result 'SUCCESS' 13:25:34 - 'Kbin_uX64__libfreenect2__ubuntu_xenial_amd64__binary' build '1' has result 'SUCCESS' 13:25:34 - 'Ksrc_uX__libfreenect2__ubuntu_xenial__source' build '1' has result 'SUCCESS' 13:25:34 - 'Ksrc_uX__kinect2_bridge__ubuntu_xenial__source' build '6' has result 'SUCCESS' 13:25:34 All recursive upstream projects are (un)stable 13:25:34 # END SECTION
13:25:34
2. Check free disk space

Hide Details

13:25:34 # BEGIN SECTION: Check free disk space 13:25:34 Usable disk space = 52479029248 bytes 13:25:34 Free space threshold = 5368709120 bytes 13:25:34 # END SECTION
13:25:34 [Kbin_uX64__kinect2_bridge__ubuntu_xenial_amd64__binary] $ /bin/sh -xe /tmp/hudson8860445134809864258.sh 13:25:34 + echo # BEGIN SECTION: docker version
3. docker version

Hide Details

13:25:34 # BEGIN SECTION: docker version 13:25:34 + docker version 13:25:34 Client: 13:25:34 Version: 1.9.1 13:25:34 API version: 1.21 13:25:34 Go version: go1.4.2 13:25:34 Git commit: a34a1d5 13:25:34 Built: Fri Nov 20 13:12:04 UTC 2015 13:25:34 OS/Arch: linux/amd64 13:25:34 13:25:34 Server: 13:25:34 Version: 1.9.1 13:25:34 API version: 1.21 13:25:34 Go version: go1.4.2 13:25:34 Git commit: a34a1d5 13:25:34 Built: Fri Nov 20 13:12:04 UTC 2015 13:25:34 OS/Arch: linux/amd64 13:25:34 + echo # END SECTION 13:25:34 # END SECTION
13:25:34 + echo # BEGIN SECTION: docker info
4. docker info

Hide Details

13:25:34 # BEGIN SECTION: docker info 13:25:34 + docker info 13:26:13 Containers: 281 13:26:13 Images: 1978 13:26:13 Server Version: 1.9.1 13:26:13 Storage Driver: aufs 13:26:13 Root Dir: /var/lib/docker/aufs 13:26:13 Backing Filesystem: extfs 13:26:13 Dirs: 2896 13:26:13 Dirperm1 Supported: false 13:26:13 Execution Driver: native-0.2 13:26:13 Logging Driver: json-file 13:26:13 Kernel Version: 3.13.0-29-generic 13:26:13 Operating System: Ubuntu 14.04 LTS 13:26:13 CPUs: 2 13:26:13 Total Memory: 3.861 GiB 13:26:13 Name: lcas-buildfarm-slave-1 13:26:13 ID: LZSS:PF7G:CREH:TEQW:FH57:3M6D:KCSS:ODQY:SPHA:ND7A:FHYG:PNDE 13:26:13 WARNING: No swap limit support 13:26:13 + echo # END SECTION 13:26:13 # END SECTION
13:26:13 [Kbin_uX64__kinect2_bridge__ubuntu_xenial_amd64__binary] $ /bin/sh -xe /tmp/hudson8460834604006308808.sh 13:26:13 + echo # BEGIN SECTION: Check docker status
5. Check docker status

Hide Details

13:26:13 # BEGIN SECTION: Check docker status 13:26:13 + echo Testing trivial docker invocation... 13:26:13 Testing trivial docker invocation... 13:26:13 + docker run --rm ubuntu:xenial true 13:26:13 Unable to find image 'ubuntu:xenial' locally 13:26:14 xenial: Pulling from library/ubuntu 13:26:14 Digest: sha256:f01976f6dc6303c5518155e3ffcfbffef77a1f47ee3084092181a298952ab268 13:26:14 Status: Downloaded newer image for ubuntu:xenial 13:26:15 + echo 'docker run' returned 0 13:26:15 'docker run' returned 0 13:26:15 docker seems operational, continuing 13:26:15 [Kbin_uX64__kinect2_bridge__ubuntu_xenial_amd64__binary] $ /bin/sh -xe /tmp/hudson4202561945246425728.sh 13:26:15 + echo # END SECTION 13:26:15 # END SECTION
13:26:15 [Kbin_uX64__kinect2_bridge__ubuntu_xenial_amd64__binary] $ /bin/sh -xe /tmp/hudson7260938380108894817.sh 13:26:15 + echo # BEGIN SECTION: Embed wrapper scripts
6. Embed wrapper scripts

Hide Details

13:26:15 # BEGIN SECTION: Embed wrapper scripts 13:26:15 + rm -fr wrapper_scripts 13:26:15 + mkdir wrapper_scripts 13:26:15 + printf #!/usr/bin/env python3\n\n# Copyright 2016 Open Source Robotics Foundation, Inc.\n#\n# Licensed under the Apache License, Version 2.0 (the "License");\n# you may not use this file except in compliance with the License.\n# You may obtain a copy of the License at\n#\n# http://www.apache.org/licenses/LICENSE-2.0\n#\n# Unless required by applicable law or agreed to in writing, software\n# distributed under the License is distributed on an "AS IS" BASIS,\n# WITHOUT WARRANTIES OR CONDITIONS OF ANY KIND, either express or implied.\n# See the License for the specific language governing permissions and\n# limitations under the License.\n\nimport subprocess\nimport sys\nfrom time import sleep\n\n\ndef main(argv=sys.argv[1:]):\n max_tries = 10\n known_error_strings = [\n 'Connection timed out',\n ]\n\n command = argv[0]\n if command == 'clone':\n rc, _, _ = call_git_repeatedly(\n argv, known_error_strings, max_tries)\n return rc\n else:\n assert "Command '%%s' not implemented" %% command\n\n\ndef call_git_repeatedly(argv, known_error_strings, max_tries):\n command = argv[0]\n for i in range(1, max_tries + 1):\n if i > 1:\n sleep_time = 5 + 2 * i\n print("Reinvoke 'git %%s' (%%d/%%d) after sleeping %%s seconds" %%\n (command, i, max_tries, sleep_time))\n sleep(sleep_time)\n rc, known_error_conditions = call_git(argv, known_error_strings)\n if rc == 0 or not known_error_conditions:\n break\n print('')\n print('Invocation failed due to the following known error conditions: '\n ', '.join(known_error_conditions))\n print('')\n # retry in case of failure with known error condition\n return rc, known_error_conditions, i\n\n\ndef call_git(argv, known_error_strings):\n known_error_conditions = []\n\n cmd = ['git'] + argv\n print("Invoking '%%s'" %% ' '.join(cmd))\n proc = subprocess.Popen(\n cmd, stdout=subprocess.PIPE, stderr=subprocess.STDOUT)\n while True:\n line = proc.stdout.readline()\n if not line:\n break\n line = line.decode()\n sys.stdout.write(line)\n for known_error_string in known_error_strings:\n if known_error_string in line:\n if known_error_string not in known_error_conditions:\n known_error_conditions.append(known_error_string)\n proc.wait()\n rc = proc.returncode\n return rc, known_error_conditions\n\n\nif __name__ == '__main__':\n sys.exit(main()) 13:26:15 + echo # END SECTION 13:26:15 # END SECTION
13:26:15 [Kbin_uX64__kinect2_bridge__ubuntu_xenial_amd64__binary] $ /bin/sh -xe /tmp/hudson747547469038972843.sh 13:26:15 + echo # BEGIN SECTION: Clone ros_buildfarm
7. Clone ros_buildfarm

Hide Details

13:26:15 # BEGIN SECTION: Clone ros_buildfarm 13:26:15 + rm -fr ros_buildfarm 13:26:15 + python3 -u wrapper_scripts/git.py clone --depth 1 -b master https://github.com/lcas/ros_buildfarm.git ros_buildfarm 13:26:16 Invoking 'git clone --depth 1 -b master https://github.com/lcas/ros_buildfarm.git ros_buildfarm' 13:26:16 Cloning into 'ros_buildfarm'... 13:26:18 + git -C ros_buildfarm --no-pager log -n 1 13:26:18 commit ab95b278101e21e7fce81180384f7861667352b1 13:26:18 Author: Marc Hanheide <marc@hanheide.net> 13:26:18 Date: Thu Apr 19 18:30:41 2018 +0100 13:26:18 13:26:18 added gcc and build-essential 13:26:18 + rm -fr ros_buildfarm/.git 13:26:18 + rm -fr ros_buildfarm/doc 13:26:18 + echo # END SECTION 13:26:18 # END SECTION
13:26:18 [Kbin_uX64__kinect2_bridge__ubuntu_xenial_amd64__binary] $ /bin/sh -xe /tmp/hudson2781752907455260098.sh 13:26:18 + echo # BEGIN SECTION: Write PGP repository keys
8. Write PGP repository keys

Hide Details

13:26:18 # BEGIN SECTION: Write PGP repository keys 13:26:18 + mkdir -p /home/jenkins-slave/workspace/Kbin_uX64__kinect2_bridge__ubuntu_xenial_amd64__binary/keys 13:26:18 + rm -fr /home/jenkins-slave/workspace/Kbin_uX64__kinect2_bridge__ubuntu_xenial_amd64__binary/keys/0.key /home/jenkins-slave/workspace/Kbin_uX64__kinect2_bridge__ubuntu_xenial_amd64__binary/keys/1.key 13:26:18 + echo -----BEGIN PGP PUBLIC KEY BLOCK----- 13:26:18 Version: GnuPG v1.4.11 (GNU/Linux) 13:26:18 13:26:18 mQENBFPzE4sBCAC9c8hzt+gqe6YqXAW9Yd10jx68M0q8IowAe182yVtIvYf5l+qn 13:26:18 MsXiDUz4l7c1TcRpdzZ1WwEQoNNjQKq51ip2Ln3Uhri/GsPBk+psIJPt5AeXYrSf 13:26:18 xcDs8k4FMWgJtYMlZLuNk1YPaS6Vf1+Ygbe0u+ssORWg3cWhgLWPDydXdlhinUgw 13:26:18 kPd9ZYi8aaAxi94DMuOnAjItfPbuX52NHmPR2cXuh3fZklhA6cCGRYkSVqijKhEv 13:26:18 /o8fTnjcTama8ml5jnaAhcZ/4UV3terLeXEQn3+WM+VbTsEr58zca5fOv8MjC+Uh 13:26:18 EBgDgnHb8/n7OgSUvv9efQgYXBRQ1mD//JaZABEBAAG0LE1hcmMgSGFuaGVpZGUg 13:26:18 KFJPU0J1aWxkKSA8bWFyY0BoYW5oZWlkZS5uZXQ+iQE4BBMBAgAiBQJT8xOLAhsD 13:26:18 BgsJCAcDAgYVCAIJCgsEFgIDAQIeAQIXgAAKCRDc10MYrtOYVB9cCACQwB9auPEX 13:26:18 yQdVwliJMLwVihKz0AU0UCG6qra2pdXx9l5kgkQCuDV5FQqMpk/MIJPn8Zj0l1MI 13:26:18 7Yn/EAqBhXjtO2BcTuUC/9epzt1p3C++vK7RSsBDXfKzZN22apIUT0njOkL9Vuoy 13:26:18 JjFetmLDaZVbmFU+4ZaX3CFtBL3ewlFiT7G6StKj40JI8QJOlDOziX2OUsqZaI2T 13:26:18 Yh681980od3f2OfV3LPVroz7xnyECDfBaPBPaDdb8XWSNVLhuyglb15eewK0hj++ 13:26:18 Cut3swWH02Y3yVhzFBnosqqjyzPLBQeDMOoHAPpJHRgprfIRDoUkWAXO5re3GIUQ 13:26:18 cvk0d1I1jh3luQENBFPzE4sBCACmSxiM1vpPI7BpgUNAhu0B8SWptULpiYOnDHfM 13:26:18 hU1u95Z5Lu/hy3sfm4BEKgLju7Y1I3jToWTwJJzgWZRr+iuuwj3fbfHCISYIK7f3 13:26:18 IWGL2iM2+kLIH6E9oqRgGbJmhiwbz6OokxG0W7atdqpBxOKqhaH0AH3qRicwnuPm 13:26:18 Z4/mNHYQ0vBffENewujn1bCAz4C1WB66/AXBYF8dpCP42qB5yK7FRNv4JubMmqhK 13:26:18 7fkD88uu7JVGRYU+temWuJHH4WDxiCmvK8nXacFaZT1NGdTL9/2EukKLguTtZumb 13:26:18 oRWgFqV6WFcEnh/V/Ma51D2+K9QbCWa8Bb6c/wKOd9Ii1aDZABEBAAGJAR8EGAEC 13:26:18 AAkFAlPzE4sCGwwACgkQ3NdDGK7TmFT2rwf+MzLFPn4Rkko38nctysbXm6qmk34U 13:26:18 NTtqirOlxg3mWeUCp7VQGU2Rg2msdo764SxCK12OhJqlXGMd2efCoQhYbMOqG6C0 13:26:18 ikBZPkd5BVFuTKsAUiuVoiQd8bDaZSpO2QdE0RdHE/yYfO66pceEKkGlcjkTRFFU 13:26:18 M7nTm7IQj4BBZclMLPr4fX520ZOVUepxAARMHW5A6EcHXvhXmblZOJM36fOv3T5N 13:26:18 l9L5tWdt/wybaRE4xuwVSs0n7MyMlWmkQxz8Z6OQscbKmuI4tcYSbvvB5tzjLBwZ 13:26:18 Chb0eEZA5ePvnGofu+3JH48FmCIPveD+4kI9GhtGkCL3Q2PiPiLcSnWQWQ== 13:26:18 =nFcN 13:26:18 -----END PGP PUBLIC KEY BLOCK----- 13:26:18 13:26:18 + echo -----BEGIN PGP PUBLIC KEY BLOCK----- 13:26:18 Version: GnuPG v1 13:26:18 13:26:18 mQGiBEsy5KkRBADJbDSISoamRM5AA20bfAeBuhhaI+VaiCVcxw90sq9AI5lIc42F 13:26:18 WzM2acm8yplqWiehAqOLKd+iIrqNGZ+VavZEPTx7o06UZUMRoPBiTFaCwrQ5avKz 13:26:18 lt7ij8PRMVWNrJ7A2lDYXfFQVV1o3Xo06qVnv0KLLUmiur0LBu4H/oTH3wCgt+/I 13:26:18 D3LUKaMJsc77KwFBTjHB0EsD/26Z2Ud12f3urSNyN6VMWnP3rz6xsmtY4Qsmkbnr 13:26:18 JuduxCQBZv6bX1Cr2ulXkv0fFOr+s5OyUv7zyCPbxiJFh3Br7fJGb0b5/M208KPe 13:26:18 giITY9hMh/aUbKjXCPoOXPxSL6SWOWV8taR6903EFyLBN0qno/kXIBKnVqBZobgn 13:26:18 jIEPA/0fTnxtZtE7EpirGQMF2caJfv7/LCgXmRs9xAhgbE0/caoa1tnc79uaHmLZ 13:26:18 FtbGFoAO31YNYM/IUHtmabbGdvZ4oYUwDhjBevVvC7aI+XhuNGK5mU8qCLLSEUOl 13:26:18 CUr6BJq/0iFmjwjmwk9idZEYhqSNy2OoYJbq45rbHfbdKLEVrbQeUk9TIEJ1aWxk 13:26:18 ZXIgPHJvc2J1aWxkQHJvcy5vcmc+iGAEExECACAFAksy5KkCGwMGCwkIBwMCBBUC 13:26:18 CAMEFgIDAQIeAQIXgAAKCRBVI7rusB+hFmk7AJ0XsLp05KA8l3YzAumZfjSN04MZ 13:26:18 jQCfQHfp4aQUXdOCUtetVo0QZUX3IuO5Ag0ESzLkrhAIAOCuSC83VXYWf8gOMSzd 13:26:18 xwpsH/uLV9Wze2LGnajsJLjEOhcsz2BHfxqNXhYaE9aQaodPCpbUAkPq8tLbpXy0 13:26:18 SWRCx0F5RcplXx5vIWbP6TlfPbRpK70w7IWd6vsNrjwEHjlhOLcNcj42sp5pgx4b 13:26:18 dceK06k5Ml2hYovPnD9o2TYgjOqg5FHZ2g1J0103n/66bN/hZnpLaZJYQiPWCyq6 13:26:18 K0565i1k2Y7hgWB/OXqwaqCehqmLTvpyQGzE1UJvKLuYU+T+4hBnSPbT3KIi5fCz 13:26:18 lIwvxijOMcfbkLhzYQXcU0Rd1VItcd5nmPL4z97jBxzuhkgxXpGR4WGKhvsA2Z9Y 13:26:18 UtsAAwYH/3Bf44bTpD9bVADUdab3e7zm8iHfh9K/a83mIgDB7mHV6WuemQVTf/1d 13:26:18 eu4mI5WtpbOCoucybGfjGIIAcSxwIx6VfC7HSp4J51bOpHhbdDffUEk6QVsZjwoF 13:26:18 yn3W9W3ZVeTI+ch/Qoo5a98SnmdjN8eXI/qCuiXOHc6rXDXc2R0iox/1EAS8xGVd 13:26:18 cYZe7IWBO2CjCknyhLrWxZHoy+i1GCZ9KvPF/Ef2dmLhCydT73ZlumsY8N5vm76Q 13:26:18 ul1G7f8LNbnMgXQafRkPffrAXSVhGY3Z2IiBwFNgxcKTq479l7yedYRGeU1A+SYI 13:26:18 YmRFWHXt3rTkMlQSpxCsB0fAYfrwEqqISQQYEQIACQUCSzLkrgIbDAAKCRBVI7ru 13:26:18 sB+hFpryAJ9qNz3h3ijt9TkAV0CHufsPT6Cl4gCglfg7tJn2lsSF3HTpoDDO1Fgg 13:26:18 x9o= 13:26:18 =AGYp 13:26:18 -----END PGP PUBLIC KEY BLOCK----- 13:26:18 13:26:18 + echo # END SECTION 13:26:18 # END SECTION
13:26:18 [Kbin_uX64__kinect2_bridge__ubuntu_xenial_amd64__binary] $ /bin/sh -xe /tmp/hudson3643737663714253653.sh 13:26:18 + rm -fr /home/jenkins-slave/workspace/Kbin_uX64__kinect2_bridge__ubuntu_xenial_amd64__binary/docker_generating_docker 13:26:18 + mkdir -p /home/jenkins-slave/workspace/Kbin_uX64__kinect2_bridge__ubuntu_xenial_amd64__binary/docker_generating_docker 13:26:18 + sleep 1 13:26:18 + python3 -u /home/jenkins-slave/workspace/Kbin_uX64__kinect2_bridge__ubuntu_xenial_amd64__binary/ros_buildfarm/scripts/subprocess_reaper.py 9280 --cid-file /home/jenkins-slave/workspace/Kbin_uX64__kinect2_bridge__ubuntu_xenial_amd64__binary/docker_generating_docker/docker.cid 13:26:19 + echo # BEGIN SECTION: Generate Dockerfile - binarydeb task
9. Generate Dockerfile - binarydeb task

Hide Details

13:26:19 # BEGIN SECTION: Generate Dockerfile - binarydeb task 13:26:19 + export TZ=GMT+00 13:26:19 + export PYTHONPATH=/home/jenkins-slave/workspace/Kbin_uX64__kinect2_bridge__ubuntu_xenial_amd64__binary/ros_buildfarm: 13:26:19 + python3 -u /home/jenkins-slave/workspace/Kbin_uX64__kinect2_bridge__ubuntu_xenial_amd64__binary/ros_buildfarm/scripts/release/run_binarydeb_job.py --rosdistro-index-url https://raw.githubusercontent.com/LCAS/rosdistro/master/index.yaml kinetic kinect2_bridge ubuntu xenial amd64 --distribution-repository-urls http://10.210.9.154/ubuntu/building http://packages.ros.org/ros/ubuntu --distribution-repository-key-files /home/jenkins-slave/workspace/Kbin_uX64__kinect2_bridge__ubuntu_xenial_amd64__binary/keys/0.key /home/jenkins-slave/workspace/Kbin_uX64__kinect2_bridge__ubuntu_xenial_amd64__binary/keys/1.key --target-repository http://10.210.9.154/ubuntu/building --binarydeb-dir /home/jenkins-slave/workspace/Kbin_uX64__kinect2_bridge__ubuntu_xenial_amd64__binary/binarydeb --dockerfile-dir /home/jenkins-slave/workspace/Kbin_uX64__kinect2_bridge__ubuntu_xenial_amd64__binary/docker_generating_docker --append-timestamp 13:26:20 Using the following distribution repositories: 13:26:20 http://10.210.9.154/ubuntu/building (/home/jenkins-slave/workspace/Kbin_uX64__kinect2_bridge__ubuntu_xenial_amd64__binary/keys/0.key) 13:26:20 http://packages.ros.org/ros/ubuntu (/home/jenkins-slave/workspace/Kbin_uX64__kinect2_bridge__ubuntu_xenial_amd64__binary/keys/1.key) 13:26:20 Generating Dockerfile '/home/jenkins-slave/workspace/Kbin_uX64__kinect2_bridge__ubuntu_xenial_amd64__binary/docker_generating_docker/Dockerfile': 13:26:20 # generated from release/binarydeb_create_task.Dockerfile.em 13:26:20 13:26:20 FROM ubuntu:xenial 13:26:20 13:26:20 VOLUME ["/var/cache/apt/archives"] 13:26:20 13:26:20 ENV DEBIAN_FRONTEND noninteractive 13:26:20 13:26:20 RUN for i in 1 2 3; do apt-get update && apt-get install -q -y locales && apt-get clean && break || if [[ $i < 3 ]]; then sleep 5; else false; fi; done 13:26:20 RUN echo "en_US.UTF-8 UTF-8" >> /etc/locale.gen 13:26:20 RUN locale-gen en_US.UTF-8 13:26:20 ENV LANG en_US.UTF-8 13:26:20 ENV TZ GMT+00 13:26:20 13:26:20 13:26:20 RUN useradd -u 1002 -m buildfarm 13:26:20 13:26:20 13:26:20 RUN mkdir /tmp/keys 13:26:20 RUN echo "-----BEGIN PGP PUBLIC KEY BLOCK-----\nVersion: GnuPG v1.4.11 (GNU/Linux)\n\nmQENBFPzE4sBCAC9c8hzt+gqe6YqXAW9Yd10jx68M0q8IowAe182yVtIvYf5l+qn\nMsXiDUz4l7c1TcRpdzZ1WwEQoNNjQKq51ip2Ln3Uhri/GsPBk+psIJPt5AeXYrSf\nxcDs8k4FMWgJtYMlZLuNk1YPaS6Vf1+Ygbe0u+ssORWg3cWhgLWPDydXdlhinUgw\nkPd9ZYi8aaAxi94DMuOnAjItfPbuX52NHmPR2cXuh3fZklhA6cCGRYkSVqijKhEv\n/o8fTnjcTama8ml5jnaAhcZ/4UV3terLeXEQn3+WM+VbTsEr58zca5fOv8MjC+Uh\nEBgDgnHb8/n7OgSUvv9efQgYXBRQ1mD//JaZABEBAAG0LE1hcmMgSGFuaGVpZGUg\nKFJPU0J1aWxkKSA8bWFyY0BoYW5oZWlkZS5uZXQ+iQE4BBMBAgAiBQJT8xOLAhsD\nBgsJCAcDAgYVCAIJCgsEFgIDAQIeAQIXgAAKCRDc10MYrtOYVB9cCACQwB9auPEX\nyQdVwliJMLwVihKz0AU0UCG6qra2pdXx9l5kgkQCuDV5FQqMpk/MIJPn8Zj0l1MI\n7Yn/EAqBhXjtO2BcTuUC/9epzt1p3C++vK7RSsBDXfKzZN22apIUT0njOkL9Vuoy\nJjFetmLDaZVbmFU+4ZaX3CFtBL3ewlFiT7G6StKj40JI8QJOlDOziX2OUsqZaI2T\nYh681980od3f2OfV3LPVroz7xnyECDfBaPBPaDdb8XWSNVLhuyglb15eewK0hj++\nCut3swWH02Y3yVhzFBnosqqjyzPLBQeDMOoHAPpJHRgprfIRDoUkWAXO5re3GIUQ\ncvk0d1I1jh3luQENBFPzE4sBCACmSxiM1vpPI7BpgUNAhu0B8SWptULpiYOnDHfM\nhU1u95Z5Lu/hy3sfm4BEKgLju7Y1I3jToWTwJJzgWZRr+iuuwj3fbfHCISYIK7f3\nIWGL2iM2+kLIH6E9oqRgGbJmhiwbz6OokxG0W7atdqpBxOKqhaH0AH3qRicwnuPm\nZ4/mNHYQ0vBffENewujn1bCAz4C1WB66/AXBYF8dpCP42qB5yK7FRNv4JubMmqhK\n7fkD88uu7JVGRYU+temWuJHH4WDxiCmvK8nXacFaZT1NGdTL9/2EukKLguTtZumb\noRWgFqV6WFcEnh/V/Ma51D2+K9QbCWa8Bb6c/wKOd9Ii1aDZABEBAAGJAR8EGAEC\nAAkFAlPzE4sCGwwACgkQ3NdDGK7TmFT2rwf+MzLFPn4Rkko38nctysbXm6qmk34U\nNTtqirOlxg3mWeUCp7VQGU2Rg2msdo764SxCK12OhJqlXGMd2efCoQhYbMOqG6C0\nikBZPkd5BVFuTKsAUiuVoiQd8bDaZSpO2QdE0RdHE/yYfO66pceEKkGlcjkTRFFU\nM7nTm7IQj4BBZclMLPr4fX520ZOVUepxAARMHW5A6EcHXvhXmblZOJM36fOv3T5N\nl9L5tWdt/wybaRE4xuwVSs0n7MyMlWmkQxz8Z6OQscbKmuI4tcYSbvvB5tzjLBwZ\nChb0eEZA5ePvnGofu+3JH48FmCIPveD+4kI9GhtGkCL3Q2PiPiLcSnWQWQ==\n=nFcN\n-----END PGP PUBLIC KEY BLOCK----- \n" > /tmp/keys/0.key && apt-key add /tmp/keys/0.key 13:26:20 RUN echo "-----BEGIN PGP PUBLIC KEY BLOCK-----\nVersion: GnuPG v1\n\nmQGiBEsy5KkRBADJbDSISoamRM5AA20bfAeBuhhaI+VaiCVcxw90sq9AI5lIc42F\nWzM2acm8yplqWiehAqOLKd+iIrqNGZ+VavZEPTx7o06UZUMRoPBiTFaCwrQ5avKz\nlt7ij8PRMVWNrJ7A2lDYXfFQVV1o3Xo06qVnv0KLLUmiur0LBu4H/oTH3wCgt+/I\nD3LUKaMJsc77KwFBTjHB0EsD/26Z2Ud12f3urSNyN6VMWnP3rz6xsmtY4Qsmkbnr\nJuduxCQBZv6bX1Cr2ulXkv0fFOr+s5OyUv7zyCPbxiJFh3Br7fJGb0b5/M208KPe\ngiITY9hMh/aUbKjXCPoOXPxSL6SWOWV8taR6903EFyLBN0qno/kXIBKnVqBZobgn\njIEPA/0fTnxtZtE7EpirGQMF2caJfv7/LCgXmRs9xAhgbE0/caoa1tnc79uaHmLZ\nFtbGFoAO31YNYM/IUHtmabbGdvZ4oYUwDhjBevVvC7aI+XhuNGK5mU8qCLLSEUOl\nCUr6BJq/0iFmjwjmwk9idZEYhqSNy2OoYJbq45rbHfbdKLEVrbQeUk9TIEJ1aWxk\nZXIgPHJvc2J1aWxkQHJvcy5vcmc+iGAEExECACAFAksy5KkCGwMGCwkIBwMCBBUC\nCAMEFgIDAQIeAQIXgAAKCRBVI7rusB+hFmk7AJ0XsLp05KA8l3YzAumZfjSN04MZ\njQCfQHfp4aQUXdOCUtetVo0QZUX3IuO5Ag0ESzLkrhAIAOCuSC83VXYWf8gOMSzd\nxwpsH/uLV9Wze2LGnajsJLjEOhcsz2BHfxqNXhYaE9aQaodPCpbUAkPq8tLbpXy0\nSWRCx0F5RcplXx5vIWbP6TlfPbRpK70w7IWd6vsNrjwEHjlhOLcNcj42sp5pgx4b\ndceK06k5Ml2hYovPnD9o2TYgjOqg5FHZ2g1J0103n/66bN/hZnpLaZJYQiPWCyq6\nK0565i1k2Y7hgWB/OXqwaqCehqmLTvpyQGzE1UJvKLuYU+T+4hBnSPbT3KIi5fCz\nlIwvxijOMcfbkLhzYQXcU0Rd1VItcd5nmPL4z97jBxzuhkgxXpGR4WGKhvsA2Z9Y\nUtsAAwYH/3Bf44bTpD9bVADUdab3e7zm8iHfh9K/a83mIgDB7mHV6WuemQVTf/1d\neu4mI5WtpbOCoucybGfjGIIAcSxwIx6VfC7HSp4J51bOpHhbdDffUEk6QVsZjwoF\nyn3W9W3ZVeTI+ch/Qoo5a98SnmdjN8eXI/qCuiXOHc6rXDXc2R0iox/1EAS8xGVd\ncYZe7IWBO2CjCknyhLrWxZHoy+i1GCZ9KvPF/Ef2dmLhCydT73ZlumsY8N5vm76Q\nul1G7f8LNbnMgXQafRkPffrAXSVhGY3Z2IiBwFNgxcKTq479l7yedYRGeU1A+SYI\nYmRFWHXt3rTkMlQSpxCsB0fAYfrwEqqISQQYEQIACQUCSzLkrgIbDAAKCRBVI7ru\nsB+hFpryAJ9qNz3h3ijt9TkAV0CHufsPT6Cl4gCglfg7tJn2lsSF3HTpoDDO1Fgg\nx9o=\n=AGYp\n-----END PGP PUBLIC KEY BLOCK-----\n" > /tmp/keys/1.key && apt-key add /tmp/keys/1.key 13:26:20 RUN echo deb http://10.210.9.154/ubuntu/building xenial main | tee -a /etc/apt/sources.list.d/buildfarm.list 13:26:20 RUN echo deb-src http://10.210.9.154/ubuntu/building xenial main | tee -a /etc/apt/sources.list.d/buildfarm.list 13:26:20 RUN echo deb http://packages.ros.org/ros/ubuntu xenial main | tee -a /etc/apt/sources.list.d/buildfarm.list 13:26:20 13:26:20 RUN grep -q -F -e "deb http://old-releases.ubuntu.com" /etc/apt/sources.list && (echo "deb http://old-releases.ubuntu.com/ubuntu/ xenial multiverse" >> /etc/apt/sources.list && echo "deb-src http://old-releases.ubuntu.com/ubuntu/ xenial multiverse" >> /etc/apt/sources.list && echo "deb http://old-releases.ubuntu.com/ubuntu/ xenial-updates multiverse" >> /etc/apt/sources.list && echo "deb-src http://old-releases.ubuntu.com/ubuntu/ xenial-updates multiverse" >> /etc/apt/sources.list && echo "deb http://old-releases.ubuntu.com/ubuntu/ xenial-security multiverse" >> /etc/apt/sources.list && echo "deb-src http://old-releases.ubuntu.com/ubuntu/ xenial-security multiverse" >> /etc/apt/sources.list) || (echo "deb http://archive.ubuntu.com/ubuntu/ xenial multiverse" >> /etc/apt/sources.list && echo "deb-src http://archive.ubuntu.com/ubuntu/ xenial multiverse" >> /etc/apt/sources.list && echo "deb http://archive.ubuntu.com/ubuntu/ xenial-updates multiverse" >> /etc/apt/sources.list && echo "deb-src http://archive.ubuntu.com/ubuntu/ xenial-updates multiverse" >> /etc/apt/sources.list && echo "deb http://archive.ubuntu.com/ubuntu/ xenial-security multiverse" >> /etc/apt/sources.list && echo "deb-src http://archive.ubuntu.com/ubuntu/ xenial-security multiverse" >> /etc/apt/sources.list) 13:26:20 13:26:20 RUN mkdir /tmp/wrapper_scripts 13:26:20 RUN echo "#!/usr/bin/env python3\n\n# Copyright 2014-2016 Open Source Robotics Foundation, Inc.\n#\n# Licensed under the Apache License, Version 2.0 (the \"License\");\n# you may not use this file except in compliance with the License.\n# You may obtain a copy of the License at\n#\n# http://www.apache.org/licenses/LICENSE-2.0\n#\n# Unless required by applicable law or agreed to in writing, software\n# distributed under the License is distributed on an \"AS IS\" BASIS,\n# WITHOUT WARRANTIES OR CONDITIONS OF ANY KIND, either express or implied.\n# See the License for the specific language governing permissions and\n# limitations under the License.\n\nimport subprocess\nimport sys\nfrom time import sleep\n\n\ndef main(argv=sys.argv[1:]):\n max_tries = 10\n known_error_strings = [\n 'Failed to fetch',\n 'Hash Sum mismatch',\n 'Unable to locate package',\n 'is not what the server reported',\n ]\n\n command = argv[0]\n if command in ['update', 'source']:\n rc, _, _ = call_apt_repeatedly(\n argv, known_error_strings, max_tries)\n return rc\n elif command == 'update-install-clean':\n return call_apt_update_install_clean(\n argv[1:], known_error_strings, max_tries)\n else:\n assert \"Command '%s' not implemented\" % command\n\n\ndef call_apt_update_install_clean(\n install_argv, known_error_strings, max_tries):\n tries = 0\n command = 'update'\n while tries < max_tries:\n if command == 'update':\n rc, _, tries = call_apt_repeatedly(\n [command], known_error_strings, max_tries - tries,\n offset=tries)\n if rc != 0:\n # abort if update was unsuccessful even after retries\n break\n # move on to the install command if update was successful\n command = 'install'\n\n if command == 'install':\n # any call is considered a try\n tries += 1\n known_error_strings_redo_update = [\n 'Size mismatch',\n 'maybe run apt update',\n 'The following packages cannot be authenticated!',\n 'Unable to locate package',\n ]\n rc, known_error_conditions = \\\\\n call_apt(\n [command] + install_argv,\n known_error_strings + known_error_strings_redo_update)\n if not known_error_conditions:\n if rc != 0:\n # abort if install was unsuccessful\n break\n # move on to the clean command if install was successful\n command = 'clean'\n continue\n\n # known errors are always interpreted as a non-zero rc\n if rc == 0:\n rc = 1\n # check if update needs to be rerun\n if (\n set(known_error_conditions) &\n set(known_error_strings_redo_update)\n ):\n command = 'update'\n print(\"'apt install' failed and likely requires \" +\n \"'apt update' to run again\")\n # retry with update command\n continue\n\n print('Invocation failed due to the following known error '\n 'conditions: ' + ', '.join(known_error_conditions))\n if tries < max_tries:\n sleep_time = 5\n print(\"Reinvoke 'apt install' after sleeping %s seconds\" %\n sleep_time)\n sleep(sleep_time)\n # retry install command\n\n if command == 'clean':\n rc, _ = call_apt([command], [])\n break\n\n return rc\n\n\ndef call_apt_repeatedly(argv, known_error_strings, max_tries, offset=0):\n command = argv[0]\n for i in range(1, max_tries + 1):\n if i > 1:\n sleep_time = 5 + 2 * (i + offset)\n print(\"Reinvoke 'apt %s' (%d/%d) after sleeping %s seconds\" %\n (command, i + offset, max_tries + offset, sleep_time))\n sleep(sleep_time)\n rc, known_error_conditions = call_apt(argv, known_error_strings)\n if not known_error_conditions:\n # break the loop and return the reported rc\n break\n # known errors are always interpreted as a non-zero rc\n if rc == 0:\n rc = 1\n print('')\n print('Invocation failed due to the following known error conditions: '\n ', '.join(known_error_conditions))\n print('')\n # retry in case of failure with known error condition\n return rc, known_error_conditions, i + offset\n\n\ndef call_apt(argv, known_error_strings):\n known_error_conditions = []\n\n # some of the used options are not supported in older distros\n # e.g. Ubuntu Wily, Debian Jessie\n cmd = ['apt-get'] + argv\n print(\"Invoking '%s'\" % ' '.join(cmd))\n proc = subprocess.Popen(\n cmd, stdout=subprocess.PIPE, stderr=subprocess.STDOUT)\n lines = []\n while True:\n line = proc.stdout.readline()\n if not line:\n break\n line = line.decode()\n lines.append(line)\n sys.stdout.write(line)\n for known_error_string in known_error_strings:\n if known_error_string in line:\n if known_error_string not in known_error_conditions:\n known_error_conditions.append(known_error_string)\n proc.wait()\n rc = proc.returncode\n if rc and not known_error_conditions:\n print('Invocation failed without any known error condition, '\n 'printing all lines to debug known error detection:')\n for index, line in enumerate(lines):\n print(' ', index + 1, \"'%s'\" % line.rstrip('\\\\n\\\\r'))\n print('None of the following known errors were detected:')\n for index, known_error_string in enumerate(known_error_strings):\n print(' ', index + 1, \"'%s'\" % known_error_string)\n return rc, known_error_conditions\n\n\nif __name__ == '__main__':\n sys.exit(main())" > /tmp/wrapper_scripts/apt.py 13:26:20 RUN echo "#!/usr/bin/env python3\n\n# Copyright 2016 Open Source Robotics Foundation, Inc.\n#\n# Licensed under the Apache License, Version 2.0 (the \"License\");\n# you may not use this file except in compliance with the License.\n# You may obtain a copy of the License at\n#\n# http://www.apache.org/licenses/LICENSE-2.0\n#\n# Unless required by applicable law or agreed to in writing, software\n# distributed under the License is distributed on an \"AS IS\" BASIS,\n# WITHOUT WARRANTIES OR CONDITIONS OF ANY KIND, either express or implied.\n# See the License for the specific language governing permissions and\n# limitations under the License.\n\nimport subprocess\nimport sys\nfrom time import sleep\n\n\ndef main(argv=sys.argv[1:]):\n max_tries = 10\n known_error_strings = [\n 'Connection timed out',\n ]\n\n command = argv[0]\n if command == 'clone':\n rc, _, _ = call_git_repeatedly(\n argv, known_error_strings, max_tries)\n return rc\n else:\n assert \"Command '%s' not implemented\" % command\n\n\ndef call_git_repeatedly(argv, known_error_strings, max_tries):\n command = argv[0]\n for i in range(1, max_tries + 1):\n if i > 1:\n sleep_time = 5 + 2 * i\n print(\"Reinvoke 'git %s' (%d/%d) after sleeping %s seconds\" %\n (command, i, max_tries, sleep_time))\n sleep(sleep_time)\n rc, known_error_conditions = call_git(argv, known_error_strings)\n if rc == 0 or not known_error_conditions:\n break\n print('')\n print('Invocation failed due to the following known error conditions: '\n ', '.join(known_error_conditions))\n print('')\n # retry in case of failure with known error condition\n return rc, known_error_conditions, i\n\n\ndef call_git(argv, known_error_strings):\n known_error_conditions = []\n\n cmd = ['git'] + argv\n print(\"Invoking '%s'\" % ' '.join(cmd))\n proc = subprocess.Popen(\n cmd, stdout=subprocess.PIPE, stderr=subprocess.STDOUT)\n while True:\n line = proc.stdout.readline()\n if not line:\n break\n line = line.decode()\n sys.stdout.write(line)\n for known_error_string in known_error_strings:\n if known_error_string in line:\n if known_error_string not in known_error_conditions:\n known_error_conditions.append(known_error_string)\n proc.wait()\n rc = proc.returncode\n return rc, known_error_conditions\n\n\nif __name__ == '__main__':\n sys.exit(main())" > /tmp/wrapper_scripts/git.py 13:26:20 13:26:20 # automatic invalidation once every day 13:26:20 RUN echo "2018-07-24 (+0000)" 13:26:20 13:26:20 RUN for i in 1 2 3; do apt-get update && apt-get install -q -y python3 && apt-get clean && break || if [[ $i < 3 ]]; then sleep 5; else false; fi; done 13:26:20 13:26:20 RUN python3 -u /tmp/wrapper_scripts/apt.py update-install-clean -q -y devscripts dpkg-dev python3-apt python3-catkin-pkg-modules python3-empy python3-rosdistro-modules python3-yaml 13:26:20 13:26:20 # always invalidate to actually have the latest apt repo state 13:26:20 RUN echo "2018-07-24 12:26:20 +0000" 13:26:20 RUN python3 -u /tmp/wrapper_scripts/apt.py update 13:26:20 13:26:20 USER buildfarm 13:26:20 ENTRYPOINT ["sh", "-c"] 13:26:20 CMD ["PYTHONPATH=/tmp/ros_buildfarm:$PYTHONPATH python3 -u /tmp/ros_buildfarm/scripts/release/get_sourcedeb.py --rosdistro-index-url https://raw.githubusercontent.com/LCAS/rosdistro/master/index.yaml kinetic kinect2_bridge --sourcedeb-dir /tmp/binarydeb && PYTHONPATH=/tmp/ros_buildfarm:$PYTHONPATH python3 -u /tmp/ros_buildfarm/scripts/release/append_build_timestamp.py kinetic kinect2_bridge --sourcedeb-dir /tmp/binarydeb && PYTHONPATH=/tmp/ros_buildfarm:$PYTHONPATH python3 -u /tmp/ros_buildfarm/scripts/release/create_binarydeb_task_generator.py --rosdistro-index-url https://raw.githubusercontent.com/LCAS/rosdistro/master/index.yaml kinetic kinect2_bridge ubuntu xenial amd64 --distribution-repository-urls http://10.210.9.154/ubuntu/building http://packages.ros.org/ros/ubuntu --distribution-repository-key-files /tmp/keys/0.key /tmp/keys/1.key --binarydeb-dir /tmp/binarydeb --dockerfile-dir /tmp/docker_build_binarydeb"] 13:26:20 + echo # END SECTION 13:26:20 # END SECTION
13:26:20 + echo # BEGIN SECTION: Build Dockerfile - binarydeb task
10. Build Dockerfile - binarydeb task

Hide Details

13:26:20 # BEGIN SECTION: Build Dockerfile - binarydeb task 13:26:20 + cd /home/jenkins-slave/workspace/Kbin_uX64__kinect2_bridge__ubuntu_xenial_amd64__binary/docker_generating_docker 13:26:20 + python3 -u /home/jenkins-slave/workspace/Kbin_uX64__kinect2_bridge__ubuntu_xenial_amd64__binary/ros_buildfarm/scripts/misc/docker_pull_baseimage.py 13:26:20 Get base image name from Dockerfile 'Dockerfile': ubuntu:xenial 13:26:20 Check docker base image for updates: docker pull ubuntu:xenial 13:26:21 xenial: Pulling from library/ubuntu 13:26:21 Digest: sha256:f01976f6dc6303c5518155e3ffcfbffef77a1f47ee3084092181a298952ab268 13:26:21 Status: Image is up to date for ubuntu:xenial 13:26:21 + docker build --force-rm -t binarydeb_task_generation.kinetic_ubuntu_xenial_amd64_kinect2_bridge . 13:26:21 Sending build context to Docker daemon 18.94 kB Sending build context to Docker daemon 18.94 kB 13:26:21 Step 1 : FROM ubuntu:xenial 13:26:21 ---> 19d7fc8e7217 13:26:21 Step 2 : VOLUME /var/cache/apt/archives 13:26:22 ---> Using cache 13:26:22 ---> b2f2542d6858 13:26:22 Step 3 : ENV DEBIAN_FRONTEND noninteractive 13:26:22 ---> Using cache 13:26:22 ---> c87b42d63979 13:26:22 Step 4 : RUN for i in 1 2 3; do apt-get update && apt-get install -q -y locales && apt-get clean && break || if [[ $i < 3 ]]; then sleep 5; else false; fi; done 13:26:22 ---> Using cache 13:26:22 ---> ef579b3479f8 13:26:22 Step 5 : RUN echo "en_US.UTF-8 UTF-8" >> /etc/locale.gen 13:26:23 ---> Using cache 13:26:23 ---> 0cd22c7dcb22 13:26:23 Step 6 : RUN locale-gen en_US.UTF-8 13:26:23 ---> Using cache 13:26:23 ---> a2bbc3dedadb 13:26:23 Step 7 : ENV LANG en_US.UTF-8 13:26:23 ---> Using cache 13:26:23 ---> b5f589218811 13:26:23 Step 8 : ENV TZ GMT+00 13:26:24 ---> Using cache 13:26:24 ---> d31af9753922 13:26:24 Step 9 : RUN useradd -u 1002 -m buildfarm 13:26:24 ---> Using cache 13:26:24 ---> 994817c47c66 13:26:24 Step 10 : RUN mkdir /tmp/keys 13:26:24 ---> Using cache 13:26:24 ---> 8842e5752fb4 13:26:24 Step 11 : RUN echo "-----BEGIN PGP PUBLIC KEY BLOCK-----\nVersion: GnuPG v1.4.11 (GNU/Linux)\n\nmQENBFPzE4sBCAC9c8hzt+gqe6YqXAW9Yd10jx68M0q8IowAe182yVtIvYf5l+qn\nMsXiDUz4l7c1TcRpdzZ1WwEQoNNjQKq51ip2Ln3Uhri/GsPBk+psIJPt5AeXYrSf\nxcDs8k4FMWgJtYMlZLuNk1YPaS6Vf1+Ygbe0u+ssORWg3cWhgLWPDydXdlhinUgw\nkPd9ZYi8aaAxi94DMuOnAjItfPbuX52NHmPR2cXuh3fZklhA6cCGRYkSVqijKhEv\n/o8fTnjcTama8ml5jnaAhcZ/4UV3terLeXEQn3+WM+VbTsEr58zca5fOv8MjC+Uh\nEBgDgnHb8/n7OgSUvv9efQgYXBRQ1mD//JaZABEBAAG0LE1hcmMgSGFuaGVpZGUg\nKFJPU0J1aWxkKSA8bWFyY0BoYW5oZWlkZS5uZXQ+iQE4BBMBAgAiBQJT8xOLAhsD\nBgsJCAcDAgYVCAIJCgsEFgIDAQIeAQIXgAAKCRDc10MYrtOYVB9cCACQwB9auPEX\nyQdVwliJMLwVihKz0AU0UCG6qra2pdXx9l5kgkQCuDV5FQqMpk/MIJPn8Zj0l1MI\n7Yn/EAqBhXjtO2BcTuUC/9epzt1p3C++vK7RSsBDXfKzZN22apIUT0njOkL9Vuoy\nJjFetmLDaZVbmFU+4ZaX3CFtBL3ewlFiT7G6StKj40JI8QJOlDOziX2OUsqZaI2T\nYh681980od3f2OfV3LPVroz7xnyECDfBaPBPaDdb8XWSNVLhuyglb15eewK0hj++\nCut3swWH02Y3yVhzFBnosqqjyzPLBQeDMOoHAPpJHRgprfIRDoUkWAXO5re3GIUQ\ncvk0d1I1jh3luQENBFPzE4sBCACmSxiM1vpPI7BpgUNAhu0B8SWptULpiYOnDHfM\nhU1u95Z5Lu/hy3sfm4BEKgLju7Y1I3jToWTwJJzgWZRr+iuuwj3fbfHCISYIK7f3\nIWGL2iM2+kLIH6E9oqRgGbJmhiwbz6OokxG0W7atdqpBxOKqhaH0AH3qRicwnuPm\nZ4/mNHYQ0vBffENewujn1bCAz4C1WB66/AXBYF8dpCP42qB5yK7FRNv4JubMmqhK\n7fkD88uu7JVGRYU+temWuJHH4WDxiCmvK8nXacFaZT1NGdTL9/2EukKLguTtZumb\noRWgFqV6WFcEnh/V/Ma51D2+K9QbCWa8Bb6c/wKOd9Ii1aDZABEBAAGJAR8EGAEC\nAAkFAlPzE4sCGwwACgkQ3NdDGK7TmFT2rwf+MzLFPn4Rkko38nctysbXm6qmk34U\nNTtqirOlxg3mWeUCp7VQGU2Rg2msdo764SxCK12OhJqlXGMd2efCoQhYbMOqG6C0\nikBZPkd5BVFuTKsAUiuVoiQd8bDaZSpO2QdE0RdHE/yYfO66pceEKkGlcjkTRFFU\nM7nTm7IQj4BBZclMLPr4fX520ZOVUepxAARMHW5A6EcHXvhXmblZOJM36fOv3T5N\nl9L5tWdt/wybaRE4xuwVSs0n7MyMlWmkQxz8Z6OQscbKmuI4tcYSbvvB5tzjLBwZ\nChb0eEZA5ePvnGofu+3JH48FmCIPveD+4kI9GhtGkCL3Q2PiPiLcSnWQWQ==\n=nFcN\n-----END PGP PUBLIC KEY BLOCK----- \n" > /tmp/keys/0.key && apt-key add /tmp/keys/0.key 13:26:25 ---> Using cache 13:26:25 ---> 26587d9f2215 13:26:25 Step 12 : RUN echo "-----BEGIN PGP PUBLIC KEY BLOCK-----\nVersion: GnuPG v1\n\nmQGiBEsy5KkRBADJbDSISoamRM5AA20bfAeBuhhaI+VaiCVcxw90sq9AI5lIc42F\nWzM2acm8yplqWiehAqOLKd+iIrqNGZ+VavZEPTx7o06UZUMRoPBiTFaCwrQ5avKz\nlt7ij8PRMVWNrJ7A2lDYXfFQVV1o3Xo06qVnv0KLLUmiur0LBu4H/oTH3wCgt+/I\nD3LUKaMJsc77KwFBTjHB0EsD/26Z2Ud12f3urSNyN6VMWnP3rz6xsmtY4Qsmkbnr\nJuduxCQBZv6bX1Cr2ulXkv0fFOr+s5OyUv7zyCPbxiJFh3Br7fJGb0b5/M208KPe\ngiITY9hMh/aUbKjXCPoOXPxSL6SWOWV8taR6903EFyLBN0qno/kXIBKnVqBZobgn\njIEPA/0fTnxtZtE7EpirGQMF2caJfv7/LCgXmRs9xAhgbE0/caoa1tnc79uaHmLZ\nFtbGFoAO31YNYM/IUHtmabbGdvZ4oYUwDhjBevVvC7aI+XhuNGK5mU8qCLLSEUOl\nCUr6BJq/0iFmjwjmwk9idZEYhqSNy2OoYJbq45rbHfbdKLEVrbQeUk9TIEJ1aWxk\nZXIgPHJvc2J1aWxkQHJvcy5vcmc+iGAEExECACAFAksy5KkCGwMGCwkIBwMCBBUC\nCAMEFgIDAQIeAQIXgAAKCRBVI7rusB+hFmk7AJ0XsLp05KA8l3YzAumZfjSN04MZ\njQCfQHfp4aQUXdOCUtetVo0QZUX3IuO5Ag0ESzLkrhAIAOCuSC83VXYWf8gOMSzd\nxwpsH/uLV9Wze2LGnajsJLjEOhcsz2BHfxqNXhYaE9aQaodPCpbUAkPq8tLbpXy0\nSWRCx0F5RcplXx5vIWbP6TlfPbRpK70w7IWd6vsNrjwEHjlhOLcNcj42sp5pgx4b\ndceK06k5Ml2hYovPnD9o2TYgjOqg5FHZ2g1J0103n/66bN/hZnpLaZJYQiPWCyq6\nK0565i1k2Y7hgWB/OXqwaqCehqmLTvpyQGzE1UJvKLuYU+T+4hBnSPbT3KIi5fCz\nlIwvxijOMcfbkLhzYQXcU0Rd1VItcd5nmPL4z97jBxzuhkgxXpGR4WGKhvsA2Z9Y\nUtsAAwYH/3Bf44bTpD9bVADUdab3e7zm8iHfh9K/a83mIgDB7mHV6WuemQVTf/1d\neu4mI5WtpbOCoucybGfjGIIAcSxwIx6VfC7HSp4J51bOpHhbdDffUEk6QVsZjwoF\nyn3W9W3ZVeTI+ch/Qoo5a98SnmdjN8eXI/qCuiXOHc6rXDXc2R0iox/1EAS8xGVd\ncYZe7IWBO2CjCknyhLrWxZHoy+i1GCZ9KvPF/Ef2dmLhCydT73ZlumsY8N5vm76Q\nul1G7f8LNbnMgXQafRkPffrAXSVhGY3Z2IiBwFNgxcKTq479l7yedYRGeU1A+SYI\nYmRFWHXt3rTkMlQSpxCsB0fAYfrwEqqISQQYEQIACQUCSzLkrgIbDAAKCRBVI7ru\nsB+hFpryAJ9qNz3h3ijt9TkAV0CHufsPT6Cl4gCglfg7tJn2lsSF3HTpoDDO1Fgg\nx9o=\n=AGYp\n-----END PGP PUBLIC KEY BLOCK-----\n" > /tmp/keys/1.key && apt-key add /tmp/keys/1.key 13:26:25 ---> Using cache 13:26:25 ---> da0f4ddae87c 13:26:25 Step 13 : RUN echo deb http://10.210.9.154/ubuntu/building xenial main | tee -a /etc/apt/sources.list.d/buildfarm.list 13:26:26 ---> Using cache 13:26:26 ---> 83d7fb748940 13:26:26 Step 14 : RUN echo deb-src http://10.210.9.154/ubuntu/building xenial main | tee -a /etc/apt/sources.list.d/buildfarm.list 13:26:26 ---> Using cache 13:26:26 ---> 9950de61b4dc 13:26:26 Step 15 : RUN echo deb http://packages.ros.org/ros/ubuntu xenial main | tee -a /etc/apt/sources.list.d/buildfarm.list 13:26:26 ---> Using cache 13:26:26 ---> 2e09e5b3c787 13:26:26 Step 16 : RUN grep -q -F -e "deb http://old-releases.ubuntu.com" /etc/apt/sources.list && (echo "deb http://old-releases.ubuntu.com/ubuntu/ xenial multiverse" >> /etc/apt/sources.list && echo "deb-src http://old-releases.ubuntu.com/ubuntu/ xenial multiverse" >> /etc/apt/sources.list && echo "deb http://old-releases.ubuntu.com/ubuntu/ xenial-updates multiverse" >> /etc/apt/sources.list && echo "deb-src http://old-releases.ubuntu.com/ubuntu/ xenial-updates multiverse" >> /etc/apt/sources.list && echo "deb http://old-releases.ubuntu.com/ubuntu/ xenial-security multiverse" >> /etc/apt/sources.list && echo "deb-src http://old-releases.ubuntu.com/ubuntu/ xenial-security multiverse" >> /etc/apt/sources.list) || (echo "deb http://archive.ubuntu.com/ubuntu/ xenial multiverse" >> /etc/apt/sources.list && echo "deb-src http://archive.ubuntu.com/ubuntu/ xenial multiverse" >> /etc/apt/sources.list && echo "deb http://archive.ubuntu.com/ubuntu/ xenial-updates multiverse" >> /etc/apt/sources.list && echo "deb-src http://archive.ubuntu.com/ubuntu/ xenial-updates multiverse" >> /etc/apt/sources.list && echo "deb http://archive.ubuntu.com/ubuntu/ xenial-security multiverse" >> /etc/apt/sources.list && echo "deb-src http://archive.ubuntu.com/ubuntu/ xenial-security multiverse" >> /etc/apt/sources.list) 13:26:27 ---> Using cache 13:26:27 ---> cdea320a8914 13:26:27 Step 17 : RUN mkdir /tmp/wrapper_scripts 13:26:27 ---> Using cache 13:26:27 ---> 199d527c93b1 13:26:27 Step 18 : RUN echo "#!/usr/bin/env python3\n\n# Copyright 2014-2016 Open Source Robotics Foundation, Inc.\n#\n# Licensed under the Apache License, Version 2.0 (the \"License\");\n# you may not use this file except in compliance with the License.\n# You may obtain a copy of the License at\n#\n# http://www.apache.org/licenses/LICENSE-2.0\n#\n# Unless required by applicable law or agreed to in writing, software\n# distributed under the License is distributed on an \"AS IS\" BASIS,\n# WITHOUT WARRANTIES OR CONDITIONS OF ANY KIND, either express or implied.\n# See the License for the specific language governing permissions and\n# limitations under the License.\n\nimport subprocess\nimport sys\nfrom time import sleep\n\n\ndef main(argv=sys.argv[1:]):\n max_tries = 10\n known_error_strings = [\n 'Failed to fetch',\n 'Hash Sum mismatch',\n 'Unable to locate package',\n 'is not what the server reported',\n ]\n\n command = argv[0]\n if command in ['update', 'source']:\n rc, _, _ = call_apt_repeatedly(\n argv, known_error_strings, max_tries)\n return rc\n elif command == 'update-install-clean':\n return call_apt_update_install_clean(\n argv[1:], known_error_strings, max_tries)\n else:\n assert \"Command '%s' not implemented\" % command\n\n\ndef call_apt_update_install_clean(\n install_argv, known_error_strings, max_tries):\n tries = 0\n command = 'update'\n while tries < max_tries:\n if command == 'update':\n rc, _, tries = call_apt_repeatedly(\n [command], known_error_strings, max_tries - tries,\n offset=tries)\n if rc != 0:\n # abort if update was unsuccessful even after retries\n break\n # move on to the install command if update was successful\n command = 'install'\n\n if command == 'install':\n # any call is considered a try\n tries += 1\n known_error_strings_redo_update = [\n 'Size mismatch',\n 'maybe run apt update',\n 'The following packages cannot be authenticated!',\n 'Unable to locate package',\n ]\n rc, known_error_conditions = \\\\\n call_apt(\n [command] + install_argv,\n known_error_strings + known_error_strings_redo_update)\n if not known_error_conditions:\n if rc != 0:\n # abort if install was unsuccessful\n break\n # move on to the clean command if install was successful\n command = 'clean'\n continue\n\n # known errors are always interpreted as a non-zero rc\n if rc == 0:\n rc = 1\n # check if update needs to be rerun\n if (\n set(known_error_conditions) &\n set(known_error_strings_redo_update)\n ):\n command = 'update'\n print(\"'apt install' failed and likely requires \" +\n \"'apt update' to run again\")\n # retry with update command\n continue\n\n print('Invocation failed due to the following known error '\n 'conditions: ' + ', '.join(known_error_conditions))\n if tries < max_tries:\n sleep_time = 5\n print(\"Reinvoke 'apt install' after sleeping %s seconds\" %\n sleep_time)\n sleep(sleep_time)\n # retry install command\n\n if command == 'clean':\n rc, _ = call_apt([command], [])\n break\n\n return rc\n\n\ndef call_apt_repeatedly(argv, known_error_strings, max_tries, offset=0):\n command = argv[0]\n for i in range(1, max_tries + 1):\n if i > 1:\n sleep_time = 5 + 2 * (i + offset)\n print(\"Reinvoke 'apt %s' (%d/%d) after sleeping %s seconds\" %\n (command, i + offset, max_tries + offset, sleep_time))\n sleep(sleep_time)\n rc, known_error_conditions = call_apt(argv, known_error_strings)\n if not known_error_conditions:\n # break the loop and return the reported rc\n break\n # known errors are always interpreted as a non-zero rc\n if rc == 0:\n rc = 1\n print('')\n print('Invocation failed due to the following known error conditions: '\n ', '.join(known_error_conditions))\n print('')\n # retry in case of failure with known error condition\n return rc, known_error_conditions, i + offset\n\n\ndef call_apt(argv, known_error_strings):\n known_error_conditions = []\n\n # some of the used options are not supported in older distros\n # e.g. Ubuntu Wily, Debian Jessie\n cmd = ['apt-get'] + argv\n print(\"Invoking '%s'\" % ' '.join(cmd))\n proc = subprocess.Popen(\n cmd, stdout=subprocess.PIPE, stderr=subprocess.STDOUT)\n lines = []\n while True:\n line = proc.stdout.readline()\n if not line:\n break\n line = line.decode()\n lines.append(line)\n sys.stdout.write(line)\n for known_error_string in known_error_strings:\n if known_error_string in line:\n if known_error_string not in known_error_conditions:\n known_error_conditions.append(known_error_string)\n proc.wait()\n rc = proc.returncode\n if rc and not known_error_conditions:\n print('Invocation failed without any known error condition, '\n 'printing all lines to debug known error detection:')\n for index, line in enumerate(lines):\n print(' ', index + 1, \"'%s'\" % line.rstrip('\\\\n\\\\r'))\n print('None of the following known errors were detected:')\n for index, known_error_string in enumerate(known_error_strings):\n print(' ', index + 1, \"'%s'\" % known_error_string)\n return rc, known_error_conditions\n\n\nif __name__ == '__main__':\n sys.exit(main())" > /tmp/wrapper_scripts/apt.py 13:26:27 ---> Using cache 13:26:27 ---> 9cca10dee901 13:26:27 Step 19 : RUN echo "#!/usr/bin/env python3\n\n# Copyright 2016 Open Source Robotics Foundation, Inc.\n#\n# Licensed under the Apache License, Version 2.0 (the \"License\");\n# you may not use this file except in compliance with the License.\n# You may obtain a copy of the License at\n#\n# http://www.apache.org/licenses/LICENSE-2.0\n#\n# Unless required by applicable law or agreed to in writing, software\n# distributed under the License is distributed on an \"AS IS\" BASIS,\n# WITHOUT WARRANTIES OR CONDITIONS OF ANY KIND, either express or implied.\n# See the License for the specific language governing permissions and\n# limitations under the License.\n\nimport subprocess\nimport sys\nfrom time import sleep\n\n\ndef main(argv=sys.argv[1:]):\n max_tries = 10\n known_error_strings = [\n 'Connection timed out',\n ]\n\n command = argv[0]\n if command == 'clone':\n rc, _, _ = call_git_repeatedly(\n argv, known_error_strings, max_tries)\n return rc\n else:\n assert \"Command '%s' not implemented\" % command\n\n\ndef call_git_repeatedly(argv, known_error_strings, max_tries):\n command = argv[0]\n for i in range(1, max_tries + 1):\n if i > 1:\n sleep_time = 5 + 2 * i\n print(\"Reinvoke 'git %s' (%d/%d) after sleeping %s seconds\" %\n (command, i, max_tries, sleep_time))\n sleep(sleep_time)\n rc, known_error_conditions = call_git(argv, known_error_strings)\n if rc == 0 or not known_error_conditions:\n break\n print('')\n print('Invocation failed due to the following known error conditions: '\n ', '.join(known_error_conditions))\n print('')\n # retry in case of failure with known error condition\n return rc, known_error_conditions, i\n\n\ndef call_git(argv, known_error_strings):\n known_error_conditions = []\n\n cmd = ['git'] + argv\n print(\"Invoking '%s'\" % ' '.join(cmd))\n proc = subprocess.Popen(\n cmd, stdout=subprocess.PIPE, stderr=subprocess.STDOUT)\n while True:\n line = proc.stdout.readline()\n if not line:\n break\n line = line.decode()\n sys.stdout.write(line)\n for known_error_string in known_error_strings:\n if known_error_string in line:\n if known_error_string not in known_error_conditions:\n known_error_conditions.append(known_error_string)\n proc.wait()\n rc = proc.returncode\n return rc, known_error_conditions\n\n\nif __name__ == '__main__':\n sys.exit(main())" > /tmp/wrapper_scripts/git.py 13:26:28 ---> Using cache 13:26:28 ---> c51d50482e99 13:26:28 Step 20 : RUN echo "2018-07-24 (+0000)" 13:26:28 ---> Using cache 13:26:28 ---> 77568a4537e9 13:26:28 Step 21 : RUN for i in 1 2 3; do apt-get update && apt-get install -q -y python3 && apt-get clean && break || if [[ $i < 3 ]]; then sleep 5; else false; fi; done 13:26:29 ---> Using cache 13:26:29 ---> 9ec90f180ba9 13:26:29 Step 22 : RUN python3 -u /tmp/wrapper_scripts/apt.py update-install-clean -q -y devscripts dpkg-dev python3-apt python3-catkin-pkg-modules python3-empy python3-rosdistro-modules python3-yaml 13:26:29 ---> Using cache 13:26:29 ---> 4c45024dd483 13:26:29 Step 23 : RUN echo "2018-07-24 12:26:20 +0000" 13:26:30 ---> Running in 0bf58855ecbf 13:26:30 2018-07-24 12:26:20 +0000 13:26:30 ---> 62b67afb5be8 13:26:30 Removing intermediate container 0bf58855ecbf 13:26:30 Step 24 : RUN python3 -u /tmp/wrapper_scripts/apt.py update 13:26:31 ---> Running in 2a655d259ecf 13:26:32 Invoking 'apt-get update' 13:26:32 Get:1 http://10.210.9.154/ubuntu/building xenial InRelease [2,856 B] 13:26:32 Hit:2 http://archive.ubuntu.com/ubuntu xenial InRelease 13:26:32 Get:3 http://security.ubuntu.com/ubuntu xenial-security InRelease [107 kB] 13:26:32 Get:4 http://archive.ubuntu.com/ubuntu xenial-updates InRelease [109 kB] 13:26:32 Get:5 http://archive.ubuntu.com/ubuntu xenial-backports InRelease [107 kB] 13:26:32 Get:6 http://archive.ubuntu.com/ubuntu xenial-security InRelease [107 kB] 13:26:32 Get:7 http://10.210.9.154/ubuntu/building xenial/main Sources [129 kB] 13:26:32 Hit:8 http://packages.ros.org/ros/ubuntu xenial InRelease 13:26:32 Get:9 http://10.210.9.154/ubuntu/building xenial/main amd64 Packages [159 kB] 13:26:32 Get:10 http://archive.ubuntu.com/ubuntu xenial-updates/multiverse Sources [9,018 B] 13:26:32 Get:11 http://archive.ubuntu.com/ubuntu xenial-updates/multiverse amd64 Packages [18.8 kB] 13:26:33 Fetched 749 kB in 1s (747 kB/s) 13:26:34 Reading package lists... 13:26:34 W: Target Packages (multiverse/binary-amd64/Packages) is configured multiple times in /etc/apt/sources.list:24 and /etc/apt/sources.list:50 13:26:34 W: Target Packages (multiverse/binary-all/Packages) is configured multiple times in /etc/apt/sources.list:24 and /etc/apt/sources.list:50 13:26:34 W: Target Packages (multiverse/binary-amd64/Packages) is configured multiple times in /etc/apt/sources.list:26 and /etc/apt/sources.list:52 13:26:34 W: Target Packages (multiverse/binary-all/Packages) is configured multiple times in /etc/apt/sources.list:26 and /etc/apt/sources.list:52 13:26:34 W: http://10.210.9.154/ubuntu/building/dists/xenial/InRelease: Signature by key 0379D44201EF3A91028107A8DCD74318AED39854 uses weak digest algorithm (SHA1) 13:26:34 W: Target Packages (multiverse/binary-amd64/Packages) is configured multiple times in /etc/apt/sources.list:24 and /etc/apt/sources.list:50 13:26:34 W: Target Packages (multiverse/binary-all/Packages) is configured multiple times in /etc/apt/sources.list:24 and /etc/apt/sources.list:50 13:26:34 W: Target Packages (multiverse/binary-amd64/Packages) is configured multiple times in /etc/apt/sources.list:26 and /etc/apt/sources.list:52 13:26:34 W: Target Packages (multiverse/binary-all/Packages) is configured multiple times in /etc/apt/sources.list:26 and /etc/apt/sources.list:52 13:26:35 ---> 559a238320c8 13:26:35 Removing intermediate container 2a655d259ecf 13:26:35 Step 25 : USER buildfarm 13:26:35 ---> Running in 372fe7b0175e 13:26:35 ---> 3672a3b9b8bc 13:26:35 Removing intermediate container 372fe7b0175e 13:26:35 Step 26 : ENTRYPOINT sh -c 13:26:35 ---> Running in 713abd879bff 13:26:35 ---> 46213e0ac6ba 13:26:35 Removing intermediate container 713abd879bff 13:26:35 Step 27 : CMD PYTHONPATH=/tmp/ros_buildfarm:$PYTHONPATH python3 -u /tmp/ros_buildfarm/scripts/release/get_sourcedeb.py --rosdistro-index-url https://raw.githubusercontent.com/LCAS/rosdistro/master/index.yaml kinetic kinect2_bridge --sourcedeb-dir /tmp/binarydeb && PYTHONPATH=/tmp/ros_buildfarm:$PYTHONPATH python3 -u /tmp/ros_buildfarm/scripts/release/append_build_timestamp.py kinetic kinect2_bridge --sourcedeb-dir /tmp/binarydeb && PYTHONPATH=/tmp/ros_buildfarm:$PYTHONPATH python3 -u /tmp/ros_buildfarm/scripts/release/create_binarydeb_task_generator.py --rosdistro-index-url https://raw.githubusercontent.com/LCAS/rosdistro/master/index.yaml kinetic kinect2_bridge ubuntu xenial amd64 --distribution-repository-urls http://10.210.9.154/ubuntu/building http://packages.ros.org/ros/ubuntu --distribution-repository-key-files /tmp/keys/0.key /tmp/keys/1.key --binarydeb-dir /tmp/binarydeb --dockerfile-dir /tmp/docker_build_binarydeb 13:26:35 ---> Running in 5c3dd2505504 13:26:36 ---> c848583b07bc 13:26:36 Removing intermediate container 5c3dd2505504 13:26:36 Successfully built c848583b07bc 13:26:36 + echo # END SECTION 13:26:36 # END SECTION
13:26:36 + echo # BEGIN SECTION: Run Dockerfile - binarydeb task
11. Run Dockerfile - binarydeb task

Hide Details

13:26:36 # BEGIN SECTION: Run Dockerfile - binarydeb task 13:26:36 + [ -f /home/jenkins-slave/workspace/Kbin_uX64__kinect2_bridge__ubuntu_xenial_amd64__binary/binarydeb ] 13:26:36 + rm -fr /home/jenkins-slave/workspace/Kbin_uX64__kinect2_bridge__ubuntu_xenial_amd64__binary/binarydeb 13:26:36 + rm -fr /home/jenkins-slave/workspace/Kbin_uX64__kinect2_bridge__ubuntu_xenial_amd64__binary/docker_build_binarydeb 13:26:36 + mkdir -p /home/jenkins-slave/workspace/Kbin_uX64__kinect2_bridge__ubuntu_xenial_amd64__binary/binarydeb 13:26:36 + mkdir -p /home/jenkins-slave/workspace/Kbin_uX64__kinect2_bridge__ubuntu_xenial_amd64__binary/docker_build_binarydeb 13:26:36 + docker run --rm --cidfile=/home/jenkins-slave/workspace/Kbin_uX64__kinect2_bridge__ubuntu_xenial_amd64__binary/docker_generating_docker/docker.cid -e=TRAVIS= -e=ROS_BUILDFARM_PULL_REQUEST_BRANCH= -v /home/jenkins-slave/workspace/Kbin_uX64__kinect2_bridge__ubuntu_xenial_amd64__binary/ros_buildfarm:/tmp/ros_buildfarm:ro -v /home/jenkins-slave/workspace/Kbin_uX64__kinect2_bridge__ubuntu_xenial_amd64__binary/binarydeb:/tmp/binarydeb -v /home/jenkins-slave/workspace/Kbin_uX64__kinect2_bridge__ubuntu_xenial_amd64__binary/docker_build_binarydeb:/tmp/docker_build_binarydeb -v /home/jenkins-slave/.ccache:/home/buildfarm/.ccache binarydeb_task_generation.kinetic_ubuntu_xenial_amd64_kinect2_bridge
11.1. get sourcedeb

Hide Details

13:26:36 # BEGIN SUBSECTION: get sourcedeb 13:26:45 W: Target Packages (multiverse/binary-amd64/Packages) is configured multiple times in /etc/apt/sources.list:24 and /etc/apt/sources.list:50 13:26:45 W: Target Packages (multiverse/binary-all/Packages) is configured multiple times in /etc/apt/sources.list:24 and /etc/apt/sources.list:50 13:26:45 W: Target Packages (multiverse/binary-amd64/Packages) is configured multiple times in /etc/apt/sources.list:26 and /etc/apt/sources.list:52 13:26:45 W: Target Packages (multiverse/binary-all/Packages) is configured multiple times in /etc/apt/sources.list:26 and /etc/apt/sources.list:52 13:26:45 Invoking '/usr/bin/python3 /tmp/ros_buildfarm/ros_buildfarm/wrapper/apt.py source --download-only --only-source ros-kinetic-kinect2-bridge=0.0.8-0xenial' 13:26:47 Invoking 'apt-get source --download-only --only-source ros-kinetic-kinect2-bridge=0.0.8-0xenial' 13:26:47 Reading package lists... 13:26:47 Need to get 29.2 kB of source archives. 13:26:47 Get:1 http://10.210.9.154/ubuntu/building xenial/main ros-kinetic-kinect2-bridge 0.0.8-0xenial (dsc) [1,290 B] 13:26:47 Get:2 http://10.210.9.154/ubuntu/building xenial/main ros-kinetic-kinect2-bridge 0.0.8-0xenial (tar) [22.0 kB] 13:26:47 Get:3 http://10.210.9.154/ubuntu/building xenial/main ros-kinetic-kinect2-bridge 0.0.8-0xenial (diff) [5,896 B] 13:26:47 Fetched 29.2 kB in 0s (1,755 kB/s) 13:26:47 Download complete and in download only mode 13:26:47 W: Target Packages (multiverse/binary-amd64/Packages) is configured multiple times in /etc/apt/sources.list:24 and /etc/apt/sources.list:50 13:26:47 W: Target Packages (multiverse/binary-all/Packages) is configured multiple times in /etc/apt/sources.list:24 and /etc/apt/sources.list:50 13:26:47 W: Target Packages (multiverse/binary-amd64/Packages) is configured multiple times in /etc/apt/sources.list:26 and /etc/apt/sources.list:52 13:26:47 W: Target Packages (multiverse/binary-all/Packages) is configured multiple times in /etc/apt/sources.list:26 and /etc/apt/sources.list:52 13:26:47 Invoking 'dpkg-source -x ros-kinetic-kinect2-bridge_0.0.8-0xenial.dsc' 13:26:48 dpkg-source: warning: extracting unsigned source package (ros-kinetic-kinect2-bridge_0.0.8-0xenial.dsc) 13:26:48 dpkg-source: info: extracting ros-kinetic-kinect2-bridge in ros-kinetic-kinect2-bridge-0.0.8 13:26:48 dpkg-source: info: unpacking ros-kinetic-kinect2-bridge_0.0.8.orig.tar.gz 13:26:48 dpkg-source: info: unpacking ros-kinetic-kinect2-bridge_0.0.8-0xenial.debian.tar.xz 13:26:48 Package maintainer emails: mfernandezcarmona@lincoln.ac.uk 13:26:48 # END SUBSECTION
11.2. append build timestamp

Hide Details

13:26:48 # BEGIN SUBSECTION: append build timestamp 13:26:48 Invoking 'debchange -v 0.0.8-0xenial-20180724-122648+0000 -p -D xenial -u high -m Append timestamp when binarydeb was built.' in '/tmp/binarydeb/ros-kinetic-kinect2-bridge-0.0.8' 13:26:48 # END SUBSECTION
13:26:52 Looking for the '.dsc' file of package 'ros-kinetic-kinect2-bridge' with version '0.0.8-0' 13:26:54 Using the following distribution repositories: 13:26:54 http://10.210.9.154/ubuntu/building (/tmp/keys/0.key) 13:26:54 http://packages.ros.org/ros/ubuntu (/tmp/keys/1.key) 13:26:54 Generating Dockerfile '/tmp/docker_build_binarydeb/Dockerfile': 13:26:54 # generated from release/binarydeb_task.Dockerfile.em 13:26:54 13:26:54 13:26:54 FROM ubuntu:xenial 13:26:54 13:26:54 VOLUME ["/var/cache/apt/archives"] 13:26:54 13:26:54 ENV DEBIAN_FRONTEND noninteractive 13:26:54 13:26:54 RUN for i in 1 2 3; do apt-get update && apt-get install -q -y locales && apt-get clean && break || if [[ $i < 3 ]]; then sleep 5; else false; fi; done 13:26:54 RUN echo "en_US.UTF-8 UTF-8" >> /etc/locale.gen 13:26:54 RUN locale-gen en_US.UTF-8 13:26:54 ENV LANG en_US.UTF-8 13:26:54 ENV TZ GMT+00 13:26:54 13:26:54 RUN useradd -u 1002 -m buildfarm 13:26:54 13:26:54 13:26:54 RUN mkdir /tmp/keys 13:26:54 RUN echo "-----BEGIN PGP PUBLIC KEY BLOCK-----\nVersion: GnuPG v1.4.11 (GNU/Linux)\n\nmQENBFPzE4sBCAC9c8hzt+gqe6YqXAW9Yd10jx68M0q8IowAe182yVtIvYf5l+qn\nMsXiDUz4l7c1TcRpdzZ1WwEQoNNjQKq51ip2Ln3Uhri/GsPBk+psIJPt5AeXYrSf\nxcDs8k4FMWgJtYMlZLuNk1YPaS6Vf1+Ygbe0u+ssORWg3cWhgLWPDydXdlhinUgw\nkPd9ZYi8aaAxi94DMuOnAjItfPbuX52NHmPR2cXuh3fZklhA6cCGRYkSVqijKhEv\n/o8fTnjcTama8ml5jnaAhcZ/4UV3terLeXEQn3+WM+VbTsEr58zca5fOv8MjC+Uh\nEBgDgnHb8/n7OgSUvv9efQgYXBRQ1mD//JaZABEBAAG0LE1hcmMgSGFuaGVpZGUg\nKFJPU0J1aWxkKSA8bWFyY0BoYW5oZWlkZS5uZXQ+iQE4BBMBAgAiBQJT8xOLAhsD\nBgsJCAcDAgYVCAIJCgsEFgIDAQIeAQIXgAAKCRDc10MYrtOYVB9cCACQwB9auPEX\nyQdVwliJMLwVihKz0AU0UCG6qra2pdXx9l5kgkQCuDV5FQqMpk/MIJPn8Zj0l1MI\n7Yn/EAqBhXjtO2BcTuUC/9epzt1p3C++vK7RSsBDXfKzZN22apIUT0njOkL9Vuoy\nJjFetmLDaZVbmFU+4ZaX3CFtBL3ewlFiT7G6StKj40JI8QJOlDOziX2OUsqZaI2T\nYh681980od3f2OfV3LPVroz7xnyECDfBaPBPaDdb8XWSNVLhuyglb15eewK0hj++\nCut3swWH02Y3yVhzFBnosqqjyzPLBQeDMOoHAPpJHRgprfIRDoUkWAXO5re3GIUQ\ncvk0d1I1jh3luQENBFPzE4sBCACmSxiM1vpPI7BpgUNAhu0B8SWptULpiYOnDHfM\nhU1u95Z5Lu/hy3sfm4BEKgLju7Y1I3jToWTwJJzgWZRr+iuuwj3fbfHCISYIK7f3\nIWGL2iM2+kLIH6E9oqRgGbJmhiwbz6OokxG0W7atdqpBxOKqhaH0AH3qRicwnuPm\nZ4/mNHYQ0vBffENewujn1bCAz4C1WB66/AXBYF8dpCP42qB5yK7FRNv4JubMmqhK\n7fkD88uu7JVGRYU+temWuJHH4WDxiCmvK8nXacFaZT1NGdTL9/2EukKLguTtZumb\noRWgFqV6WFcEnh/V/Ma51D2+K9QbCWa8Bb6c/wKOd9Ii1aDZABEBAAGJAR8EGAEC\nAAkFAlPzE4sCGwwACgkQ3NdDGK7TmFT2rwf+MzLFPn4Rkko38nctysbXm6qmk34U\nNTtqirOlxg3mWeUCp7VQGU2Rg2msdo764SxCK12OhJqlXGMd2efCoQhYbMOqG6C0\nikBZPkd5BVFuTKsAUiuVoiQd8bDaZSpO2QdE0RdHE/yYfO66pceEKkGlcjkTRFFU\nM7nTm7IQj4BBZclMLPr4fX520ZOVUepxAARMHW5A6EcHXvhXmblZOJM36fOv3T5N\nl9L5tWdt/wybaRE4xuwVSs0n7MyMlWmkQxz8Z6OQscbKmuI4tcYSbvvB5tzjLBwZ\nChb0eEZA5ePvnGofu+3JH48FmCIPveD+4kI9GhtGkCL3Q2PiPiLcSnWQWQ==\n=nFcN\n-----END PGP PUBLIC KEY BLOCK----- \n" > /tmp/keys/0.key && apt-key add /tmp/keys/0.key 13:26:54 RUN echo "-----BEGIN PGP PUBLIC KEY BLOCK-----\nVersion: GnuPG v1\n\nmQGiBEsy5KkRBADJbDSISoamRM5AA20bfAeBuhhaI+VaiCVcxw90sq9AI5lIc42F\nWzM2acm8yplqWiehAqOLKd+iIrqNGZ+VavZEPTx7o06UZUMRoPBiTFaCwrQ5avKz\nlt7ij8PRMVWNrJ7A2lDYXfFQVV1o3Xo06qVnv0KLLUmiur0LBu4H/oTH3wCgt+/I\nD3LUKaMJsc77KwFBTjHB0EsD/26Z2Ud12f3urSNyN6VMWnP3rz6xsmtY4Qsmkbnr\nJuduxCQBZv6bX1Cr2ulXkv0fFOr+s5OyUv7zyCPbxiJFh3Br7fJGb0b5/M208KPe\ngiITY9hMh/aUbKjXCPoOXPxSL6SWOWV8taR6903EFyLBN0qno/kXIBKnVqBZobgn\njIEPA/0fTnxtZtE7EpirGQMF2caJfv7/LCgXmRs9xAhgbE0/caoa1tnc79uaHmLZ\nFtbGFoAO31YNYM/IUHtmabbGdvZ4oYUwDhjBevVvC7aI+XhuNGK5mU8qCLLSEUOl\nCUr6BJq/0iFmjwjmwk9idZEYhqSNy2OoYJbq45rbHfbdKLEVrbQeUk9TIEJ1aWxk\nZXIgPHJvc2J1aWxkQHJvcy5vcmc+iGAEExECACAFAksy5KkCGwMGCwkIBwMCBBUC\nCAMEFgIDAQIeAQIXgAAKCRBVI7rusB+hFmk7AJ0XsLp05KA8l3YzAumZfjSN04MZ\njQCfQHfp4aQUXdOCUtetVo0QZUX3IuO5Ag0ESzLkrhAIAOCuSC83VXYWf8gOMSzd\nxwpsH/uLV9Wze2LGnajsJLjEOhcsz2BHfxqNXhYaE9aQaodPCpbUAkPq8tLbpXy0\nSWRCx0F5RcplXx5vIWbP6TlfPbRpK70w7IWd6vsNrjwEHjlhOLcNcj42sp5pgx4b\ndceK06k5Ml2hYovPnD9o2TYgjOqg5FHZ2g1J0103n/66bN/hZnpLaZJYQiPWCyq6\nK0565i1k2Y7hgWB/OXqwaqCehqmLTvpyQGzE1UJvKLuYU+T+4hBnSPbT3KIi5fCz\nlIwvxijOMcfbkLhzYQXcU0Rd1VItcd5nmPL4z97jBxzuhkgxXpGR4WGKhvsA2Z9Y\nUtsAAwYH/3Bf44bTpD9bVADUdab3e7zm8iHfh9K/a83mIgDB7mHV6WuemQVTf/1d\neu4mI5WtpbOCoucybGfjGIIAcSxwIx6VfC7HSp4J51bOpHhbdDffUEk6QVsZjwoF\nyn3W9W3ZVeTI+ch/Qoo5a98SnmdjN8eXI/qCuiXOHc6rXDXc2R0iox/1EAS8xGVd\ncYZe7IWBO2CjCknyhLrWxZHoy+i1GCZ9KvPF/Ef2dmLhCydT73ZlumsY8N5vm76Q\nul1G7f8LNbnMgXQafRkPffrAXSVhGY3Z2IiBwFNgxcKTq479l7yedYRGeU1A+SYI\nYmRFWHXt3rTkMlQSpxCsB0fAYfrwEqqISQQYEQIACQUCSzLkrgIbDAAKCRBVI7ru\nsB+hFpryAJ9qNz3h3ijt9TkAV0CHufsPT6Cl4gCglfg7tJn2lsSF3HTpoDDO1Fgg\nx9o=\n=AGYp\n-----END PGP PUBLIC KEY BLOCK-----\n" > /tmp/keys/1.key && apt-key add /tmp/keys/1.key 13:26:54 RUN echo deb http://10.210.9.154/ubuntu/building xenial main | tee -a /etc/apt/sources.list.d/buildfarm.list 13:26:54 RUN echo deb http://packages.ros.org/ros/ubuntu xenial main | tee -a /etc/apt/sources.list.d/buildfarm.list 13:26:54 13:26:54 RUN grep -q -F -e "deb http://old-releases.ubuntu.com" /etc/apt/sources.list && (echo "deb http://old-releases.ubuntu.com/ubuntu/ xenial multiverse" >> /etc/apt/sources.list && echo "deb-src http://old-releases.ubuntu.com/ubuntu/ xenial multiverse" >> /etc/apt/sources.list && echo "deb http://old-releases.ubuntu.com/ubuntu/ xenial-updates multiverse" >> /etc/apt/sources.list && echo "deb-src http://old-releases.ubuntu.com/ubuntu/ xenial-updates multiverse" >> /etc/apt/sources.list && echo "deb http://old-releases.ubuntu.com/ubuntu/ xenial-security multiverse" >> /etc/apt/sources.list && echo "deb-src http://old-releases.ubuntu.com/ubuntu/ xenial-security multiverse" >> /etc/apt/sources.list) || (echo "deb http://archive.ubuntu.com/ubuntu/ xenial multiverse" >> /etc/apt/sources.list && echo "deb-src http://archive.ubuntu.com/ubuntu/ xenial multiverse" >> /etc/apt/sources.list && echo "deb http://archive.ubuntu.com/ubuntu/ xenial-updates multiverse" >> /etc/apt/sources.list && echo "deb-src http://archive.ubuntu.com/ubuntu/ xenial-updates multiverse" >> /etc/apt/sources.list && echo "deb http://archive.ubuntu.com/ubuntu/ xenial-security multiverse" >> /etc/apt/sources.list && echo "deb-src http://archive.ubuntu.com/ubuntu/ xenial-security multiverse" >> /etc/apt/sources.list) 13:26:54 13:26:54 RUN mkdir /tmp/wrapper_scripts 13:26:54 RUN echo "#!/usr/bin/env python3\n\n# Copyright 2014-2016 Open Source Robotics Foundation, Inc.\n#\n# Licensed under the Apache License, Version 2.0 (the \"License\");\n# you may not use this file except in compliance with the License.\n# You may obtain a copy of the License at\n#\n# http://www.apache.org/licenses/LICENSE-2.0\n#\n# Unless required by applicable law or agreed to in writing, software\n# distributed under the License is distributed on an \"AS IS\" BASIS,\n# WITHOUT WARRANTIES OR CONDITIONS OF ANY KIND, either express or implied.\n# See the License for the specific language governing permissions and\n# limitations under the License.\n\nimport subprocess\nimport sys\nfrom time import sleep\n\n\ndef main(argv=sys.argv[1:]):\n max_tries = 10\n known_error_strings = [\n 'Failed to fetch',\n 'Hash Sum mismatch',\n 'Unable to locate package',\n 'is not what the server reported',\n ]\n\n command = argv[0]\n if command in ['update', 'source']:\n rc, _, _ = call_apt_repeatedly(\n argv, known_error_strings, max_tries)\n return rc\n elif command == 'update-install-clean':\n return call_apt_update_install_clean(\n argv[1:], known_error_strings, max_tries)\n else:\n assert \"Command '%s' not implemented\" % command\n\n\ndef call_apt_update_install_clean(\n install_argv, known_error_strings, max_tries):\n tries = 0\n command = 'update'\n while tries < max_tries:\n if command == 'update':\n rc, _, tries = call_apt_repeatedly(\n [command], known_error_strings, max_tries - tries,\n offset=tries)\n if rc != 0:\n # abort if update was unsuccessful even after retries\n break\n # move on to the install command if update was successful\n command = 'install'\n\n if command == 'install':\n # any call is considered a try\n tries += 1\n known_error_strings_redo_update = [\n 'Size mismatch',\n 'maybe run apt update',\n 'The following packages cannot be authenticated!',\n 'Unable to locate package',\n ]\n rc, known_error_conditions = \\\\\n call_apt(\n [command] + install_argv,\n known_error_strings + known_error_strings_redo_update)\n if not known_error_conditions:\n if rc != 0:\n # abort if install was unsuccessful\n break\n # move on to the clean command if install was successful\n command = 'clean'\n continue\n\n # known errors are always interpreted as a non-zero rc\n if rc == 0:\n rc = 1\n # check if update needs to be rerun\n if (\n set(known_error_conditions) &\n set(known_error_strings_redo_update)\n ):\n command = 'update'\n print(\"'apt install' failed and likely requires \" +\n \"'apt update' to run again\")\n # retry with update command\n continue\n\n print('Invocation failed due to the following known error '\n 'conditions: ' + ', '.join(known_error_conditions))\n if tries < max_tries:\n sleep_time = 5\n print(\"Reinvoke 'apt install' after sleeping %s seconds\" %\n sleep_time)\n sleep(sleep_time)\n # retry install command\n\n if command == 'clean':\n rc, _ = call_apt([command], [])\n break\n\n return rc\n\n\ndef call_apt_repeatedly(argv, known_error_strings, max_tries, offset=0):\n command = argv[0]\n for i in range(1, max_tries + 1):\n if i > 1:\n sleep_time = 5 + 2 * (i + offset)\n print(\"Reinvoke 'apt %s' (%d/%d) after sleeping %s seconds\" %\n (command, i + offset, max_tries + offset, sleep_time))\n sleep(sleep_time)\n rc, known_error_conditions = call_apt(argv, known_error_strings)\n if not known_error_conditions:\n # break the loop and return the reported rc\n break\n # known errors are always interpreted as a non-zero rc\n if rc == 0:\n rc = 1\n print('')\n print('Invocation failed due to the following known error conditions: '\n ', '.join(known_error_conditions))\n print('')\n # retry in case of failure with known error condition\n return rc, known_error_conditions, i + offset\n\n\ndef call_apt(argv, known_error_strings):\n known_error_conditions = []\n\n # some of the used options are not supported in older distros\n # e.g. Ubuntu Wily, Debian Jessie\n cmd = ['apt-get'] + argv\n print(\"Invoking '%s'\" % ' '.join(cmd))\n proc = subprocess.Popen(\n cmd, stdout=subprocess.PIPE, stderr=subprocess.STDOUT)\n lines = []\n while True:\n line = proc.stdout.readline()\n if not line:\n break\n line = line.decode()\n lines.append(line)\n sys.stdout.write(line)\n for known_error_string in known_error_strings:\n if known_error_string in line:\n if known_error_string not in known_error_conditions:\n known_error_conditions.append(known_error_string)\n proc.wait()\n rc = proc.returncode\n if rc and not known_error_conditions:\n print('Invocation failed without any known error condition, '\n 'printing all lines to debug known error detection:')\n for index, line in enumerate(lines):\n print(' ', index + 1, \"'%s'\" % line.rstrip('\\\\n\\\\r'))\n print('None of the following known errors were detected:')\n for index, known_error_string in enumerate(known_error_strings):\n print(' ', index + 1, \"'%s'\" % known_error_string)\n return rc, known_error_conditions\n\n\nif __name__ == '__main__':\n sys.exit(main())" > /tmp/wrapper_scripts/apt.py 13:26:54 RUN echo "#!/usr/bin/env python3\n\n# Copyright 2016 Open Source Robotics Foundation, Inc.\n#\n# Licensed under the Apache License, Version 2.0 (the \"License\");\n# you may not use this file except in compliance with the License.\n# You may obtain a copy of the License at\n#\n# http://www.apache.org/licenses/LICENSE-2.0\n#\n# Unless required by applicable law or agreed to in writing, software\n# distributed under the License is distributed on an \"AS IS\" BASIS,\n# WITHOUT WARRANTIES OR CONDITIONS OF ANY KIND, either express or implied.\n# See the License for the specific language governing permissions and\n# limitations under the License.\n\nimport subprocess\nimport sys\nfrom time import sleep\n\n\ndef main(argv=sys.argv[1:]):\n max_tries = 10\n known_error_strings = [\n 'Connection timed out',\n ]\n\n command = argv[0]\n if command == 'clone':\n rc, _, _ = call_git_repeatedly(\n argv, known_error_strings, max_tries)\n return rc\n else:\n assert \"Command '%s' not implemented\" % command\n\n\ndef call_git_repeatedly(argv, known_error_strings, max_tries):\n command = argv[0]\n for i in range(1, max_tries + 1):\n if i > 1:\n sleep_time = 5 + 2 * i\n print(\"Reinvoke 'git %s' (%d/%d) after sleeping %s seconds\" %\n (command, i, max_tries, sleep_time))\n sleep(sleep_time)\n rc, known_error_conditions = call_git(argv, known_error_strings)\n if rc == 0 or not known_error_conditions:\n break\n print('')\n print('Invocation failed due to the following known error conditions: '\n ', '.join(known_error_conditions))\n print('')\n # retry in case of failure with known error condition\n return rc, known_error_conditions, i\n\n\ndef call_git(argv, known_error_strings):\n known_error_conditions = []\n\n cmd = ['git'] + argv\n print(\"Invoking '%s'\" % ' '.join(cmd))\n proc = subprocess.Popen(\n cmd, stdout=subprocess.PIPE, stderr=subprocess.STDOUT)\n while True:\n line = proc.stdout.readline()\n if not line:\n break\n line = line.decode()\n sys.stdout.write(line)\n for known_error_string in known_error_strings:\n if known_error_string in line:\n if known_error_string not in known_error_conditions:\n known_error_conditions.append(known_error_string)\n proc.wait()\n rc = proc.returncode\n return rc, known_error_conditions\n\n\nif __name__ == '__main__':\n sys.exit(main())" > /tmp/wrapper_scripts/git.py 13:26:54 13:26:54 # automatic invalidation once every day 13:26:54 RUN echo "2018-07-24 (+0000)" 13:26:54 13:26:54 RUN for i in 1 2 3; do apt-get update && apt-get install -q -y python3 && apt-get clean && break || if [[ $i < 3 ]]; then sleep 5; else false; fi; done 13:26:54 13:26:54 RUN python3 -u /tmp/wrapper_scripts/apt.py update-install-clean -q -y ccache gcc build-essential 13:26:54 13:26:54 # for each dependency: echo version, apt update, apt install, apt clean 13:26:54 # to prevent exceeding the docker layer limit several lines have been folded 13:26:54 RUN echo "apt-src: 0.25.1-0.2" && echo "debhelper: 10.2.2ubuntu1~ubuntu16.04.1" && python3 -u /tmp/wrapper_scripts/apt.py update-install-clean -q -y -o Debug::pkgProblemResolver=yes apt-src debhelper 13:26:54 RUN echo "ros-kinetic-catkin: 0.7.11-0xenial-20180222-175501-0800" && echo "ros-kinetic-compressed-depth-image-transport: 1.9.5-0xenial-20180516-184736-0800" && echo "ros-kinetic-cv-bridge: 1.12.8-0xenial-20180516-152244-0800" && python3 -u /tmp/wrapper_scripts/apt.py update-install-clean -q -y -o Debug::pkgProblemResolver=yes ros-kinetic-catkin ros-kinetic-compressed-depth-image-transport ros-kinetic-cv-bridge 13:26:54 RUN echo "ros-kinetic-kinect2-registration: 0.0.8-0xenial-20180724-115829+0000" && echo "ros-kinetic-libfreenect2: 0.0.8-0xenial-20180724-082945+0000" && echo "ros-kinetic-message-filters: 1.12.13-0xenial-20180222-225300-0800" && python3 -u /tmp/wrapper_scripts/apt.py update-install-clean -q -y -o Debug::pkgProblemResolver=yes ros-kinetic-kinect2-registration ros-kinetic-libfreenect2 ros-kinetic-message-filters 13:26:54 RUN echo "ros-kinetic-nodelet: 1.9.14-0xenial-20180316-123613-0800" && echo "ros-kinetic-roscpp: 1.12.13-0xenial-20180222-205956-0800" && echo "ros-kinetic-rostime: 0.6.9-0xenial-20180222-192424-0800" && python3 -u /tmp/wrapper_scripts/apt.py update-install-clean -q -y -o Debug::pkgProblemResolver=yes ros-kinetic-nodelet ros-kinetic-roscpp ros-kinetic-rostime 13:26:54 RUN echo "ros-kinetic-sensor-msgs: 1.12.6-0xenial-20180516-133456-0800" && echo "ros-kinetic-std-msgs: 0.5.11-0xenial-20180222-195509-0800" && echo "ros-kinetic-tf: 1.11.9-0xenial-20180516-161707-0800" && python3 -u /tmp/wrapper_scripts/apt.py update-install-clean -q -y -o Debug::pkgProblemResolver=yes ros-kinetic-sensor-msgs ros-kinetic-std-msgs ros-kinetic-tf 13:26:54 13:26:54 USER buildfarm 13:26:54 ENTRYPOINT ["sh", "-c"] 13:26:54 CMD ["PYTHONPATH=/tmp/ros_buildfarm:$PYTHONPATH PATH=/usr/lib/ccache:$PATH python3 -u /tmp/ros_buildfarm/scripts/release/build_binarydeb.py kinetic kinect2_bridge --sourcedeb-dir /tmp/binarydeb"] 13:26:54 Mount the following volumes when running the container: 13:26:54 -v /tmp/ros_buildfarm:/tmp/ros_buildfarm:ro 13:26:54 -v /tmp/binarydeb:/tmp/binarydeb 13:26:54 + echo # END SECTION 13:26:54 # END SECTION
13:26:54 [Kbin_uX64__kinect2_bridge__ubuntu_xenial_amd64__binary] $ /bin/sh -xe /tmp/hudson8379014423915808333.sh 13:26:54 + sleep 1 13:26:54 + python3 -u /home/jenkins-slave/workspace/Kbin_uX64__kinect2_bridge__ubuntu_xenial_amd64__binary/ros_buildfarm/scripts/subprocess_reaper.py 9885 --cid-file /home/jenkins-slave/workspace/Kbin_uX64__kinect2_bridge__ubuntu_xenial_amd64__binary/docker_build_binarydeb/docker.cid 13:26:55 + echo # BEGIN SECTION: Build Dockerfile - build binarydeb
12. Build Dockerfile - build binarydeb

Hide Details

13:26:55 # BEGIN SECTION: Build Dockerfile - build binarydeb 13:26:55 + cd /home/jenkins-slave/workspace/Kbin_uX64__kinect2_bridge__ubuntu_xenial_amd64__binary/docker_build_binarydeb 13:26:55 + python3 -u /home/jenkins-slave/workspace/Kbin_uX64__kinect2_bridge__ubuntu_xenial_amd64__binary/ros_buildfarm/scripts/misc/docker_pull_baseimage.py 13:26:55 Get base image name from Dockerfile 'Dockerfile': ubuntu:xenial 13:26:55 Check docker base image for updates: docker pull ubuntu:xenial 13:26:56 xenial: Pulling from library/ubuntu 13:26:56 Digest: sha256:f01976f6dc6303c5518155e3ffcfbffef77a1f47ee3084092181a298952ab268 13:26:56 Status: Image is up to date for ubuntu:xenial 13:26:56 + docker build --force-rm -t binarydeb_build.kinetic_ubuntu_xenial_amd64_kinect2_bridge . 13:26:57 Sending build context to Docker daemon 19.97 kB Sending build context to Docker daemon 19.97 kB 13:26:57 Step 1 : FROM ubuntu:xenial 13:26:57 ---> 19d7fc8e7217 13:26:57 Step 2 : VOLUME /var/cache/apt/archives 13:26:57 ---> Using cache 13:26:57 ---> b2f2542d6858 13:26:57 Step 3 : ENV DEBIAN_FRONTEND noninteractive 13:26:57 ---> Using cache 13:26:57 ---> c87b42d63979 13:26:57 Step 4 : RUN for i in 1 2 3; do apt-get update && apt-get install -q -y locales && apt-get clean && break || if [[ $i < 3 ]]; then sleep 5; else false; fi; done 13:26:58 ---> Using cache 13:26:58 ---> ef579b3479f8 13:26:58 Step 5 : RUN echo "en_US.UTF-8 UTF-8" >> /etc/locale.gen 13:26:58 ---> Using cache 13:26:58 ---> 0cd22c7dcb22 13:26:58 Step 6 : RUN locale-gen en_US.UTF-8 13:26:58 ---> Using cache 13:26:58 ---> a2bbc3dedadb 13:26:58 Step 7 : ENV LANG en_US.UTF-8 13:26:59 ---> Using cache 13:26:59 ---> b5f589218811 13:26:59 Step 8 : ENV TZ GMT+00 13:26:59 ---> Using cache 13:26:59 ---> d31af9753922 13:26:59 Step 9 : RUN useradd -u 1002 -m buildfarm 13:27:00 ---> Using cache 13:27:00 ---> 994817c47c66 13:27:00 Step 10 : RUN mkdir /tmp/keys 13:27:00 ---> Using cache 13:27:00 ---> 8842e5752fb4 13:27:00 Step 11 : RUN echo "-----BEGIN PGP PUBLIC KEY BLOCK-----\nVersion: GnuPG v1.4.11 (GNU/Linux)\n\nmQENBFPzE4sBCAC9c8hzt+gqe6YqXAW9Yd10jx68M0q8IowAe182yVtIvYf5l+qn\nMsXiDUz4l7c1TcRpdzZ1WwEQoNNjQKq51ip2Ln3Uhri/GsPBk+psIJPt5AeXYrSf\nxcDs8k4FMWgJtYMlZLuNk1YPaS6Vf1+Ygbe0u+ssORWg3cWhgLWPDydXdlhinUgw\nkPd9ZYi8aaAxi94DMuOnAjItfPbuX52NHmPR2cXuh3fZklhA6cCGRYkSVqijKhEv\n/o8fTnjcTama8ml5jnaAhcZ/4UV3terLeXEQn3+WM+VbTsEr58zca5fOv8MjC+Uh\nEBgDgnHb8/n7OgSUvv9efQgYXBRQ1mD//JaZABEBAAG0LE1hcmMgSGFuaGVpZGUg\nKFJPU0J1aWxkKSA8bWFyY0BoYW5oZWlkZS5uZXQ+iQE4BBMBAgAiBQJT8xOLAhsD\nBgsJCAcDAgYVCAIJCgsEFgIDAQIeAQIXgAAKCRDc10MYrtOYVB9cCACQwB9auPEX\nyQdVwliJMLwVihKz0AU0UCG6qra2pdXx9l5kgkQCuDV5FQqMpk/MIJPn8Zj0l1MI\n7Yn/EAqBhXjtO2BcTuUC/9epzt1p3C++vK7RSsBDXfKzZN22apIUT0njOkL9Vuoy\nJjFetmLDaZVbmFU+4ZaX3CFtBL3ewlFiT7G6StKj40JI8QJOlDOziX2OUsqZaI2T\nYh681980od3f2OfV3LPVroz7xnyECDfBaPBPaDdb8XWSNVLhuyglb15eewK0hj++\nCut3swWH02Y3yVhzFBnosqqjyzPLBQeDMOoHAPpJHRgprfIRDoUkWAXO5re3GIUQ\ncvk0d1I1jh3luQENBFPzE4sBCACmSxiM1vpPI7BpgUNAhu0B8SWptULpiYOnDHfM\nhU1u95Z5Lu/hy3sfm4BEKgLju7Y1I3jToWTwJJzgWZRr+iuuwj3fbfHCISYIK7f3\nIWGL2iM2+kLIH6E9oqRgGbJmhiwbz6OokxG0W7atdqpBxOKqhaH0AH3qRicwnuPm\nZ4/mNHYQ0vBffENewujn1bCAz4C1WB66/AXBYF8dpCP42qB5yK7FRNv4JubMmqhK\n7fkD88uu7JVGRYU+temWuJHH4WDxiCmvK8nXacFaZT1NGdTL9/2EukKLguTtZumb\noRWgFqV6WFcEnh/V/Ma51D2+K9QbCWa8Bb6c/wKOd9Ii1aDZABEBAAGJAR8EGAEC\nAAkFAlPzE4sCGwwACgkQ3NdDGK7TmFT2rwf+MzLFPn4Rkko38nctysbXm6qmk34U\nNTtqirOlxg3mWeUCp7VQGU2Rg2msdo764SxCK12OhJqlXGMd2efCoQhYbMOqG6C0\nikBZPkd5BVFuTKsAUiuVoiQd8bDaZSpO2QdE0RdHE/yYfO66pceEKkGlcjkTRFFU\nM7nTm7IQj4BBZclMLPr4fX520ZOVUepxAARMHW5A6EcHXvhXmblZOJM36fOv3T5N\nl9L5tWdt/wybaRE4xuwVSs0n7MyMlWmkQxz8Z6OQscbKmuI4tcYSbvvB5tzjLBwZ\nChb0eEZA5ePvnGofu+3JH48FmCIPveD+4kI9GhtGkCL3Q2PiPiLcSnWQWQ==\n=nFcN\n-----END PGP PUBLIC KEY BLOCK----- \n" > /tmp/keys/0.key && apt-key add /tmp/keys/0.key 13:27:00 ---> Using cache 13:27:00 ---> 26587d9f2215 13:27:00 Step 12 : RUN echo "-----BEGIN PGP PUBLIC KEY BLOCK-----\nVersion: GnuPG v1\n\nmQGiBEsy5KkRBADJbDSISoamRM5AA20bfAeBuhhaI+VaiCVcxw90sq9AI5lIc42F\nWzM2acm8yplqWiehAqOLKd+iIrqNGZ+VavZEPTx7o06UZUMRoPBiTFaCwrQ5avKz\nlt7ij8PRMVWNrJ7A2lDYXfFQVV1o3Xo06qVnv0KLLUmiur0LBu4H/oTH3wCgt+/I\nD3LUKaMJsc77KwFBTjHB0EsD/26Z2Ud12f3urSNyN6VMWnP3rz6xsmtY4Qsmkbnr\nJuduxCQBZv6bX1Cr2ulXkv0fFOr+s5OyUv7zyCPbxiJFh3Br7fJGb0b5/M208KPe\ngiITY9hMh/aUbKjXCPoOXPxSL6SWOWV8taR6903EFyLBN0qno/kXIBKnVqBZobgn\njIEPA/0fTnxtZtE7EpirGQMF2caJfv7/LCgXmRs9xAhgbE0/caoa1tnc79uaHmLZ\nFtbGFoAO31YNYM/IUHtmabbGdvZ4oYUwDhjBevVvC7aI+XhuNGK5mU8qCLLSEUOl\nCUr6BJq/0iFmjwjmwk9idZEYhqSNy2OoYJbq45rbHfbdKLEVrbQeUk9TIEJ1aWxk\nZXIgPHJvc2J1aWxkQHJvcy5vcmc+iGAEExECACAFAksy5KkCGwMGCwkIBwMCBBUC\nCAMEFgIDAQIeAQIXgAAKCRBVI7rusB+hFmk7AJ0XsLp05KA8l3YzAumZfjSN04MZ\njQCfQHfp4aQUXdOCUtetVo0QZUX3IuO5Ag0ESzLkrhAIAOCuSC83VXYWf8gOMSzd\nxwpsH/uLV9Wze2LGnajsJLjEOhcsz2BHfxqNXhYaE9aQaodPCpbUAkPq8tLbpXy0\nSWRCx0F5RcplXx5vIWbP6TlfPbRpK70w7IWd6vsNrjwEHjlhOLcNcj42sp5pgx4b\ndceK06k5Ml2hYovPnD9o2TYgjOqg5FHZ2g1J0103n/66bN/hZnpLaZJYQiPWCyq6\nK0565i1k2Y7hgWB/OXqwaqCehqmLTvpyQGzE1UJvKLuYU+T+4hBnSPbT3KIi5fCz\nlIwvxijOMcfbkLhzYQXcU0Rd1VItcd5nmPL4z97jBxzuhkgxXpGR4WGKhvsA2Z9Y\nUtsAAwYH/3Bf44bTpD9bVADUdab3e7zm8iHfh9K/a83mIgDB7mHV6WuemQVTf/1d\neu4mI5WtpbOCoucybGfjGIIAcSxwIx6VfC7HSp4J51bOpHhbdDffUEk6QVsZjwoF\nyn3W9W3ZVeTI+ch/Qoo5a98SnmdjN8eXI/qCuiXOHc6rXDXc2R0iox/1EAS8xGVd\ncYZe7IWBO2CjCknyhLrWxZHoy+i1GCZ9KvPF/Ef2dmLhCydT73ZlumsY8N5vm76Q\nul1G7f8LNbnMgXQafRkPffrAXSVhGY3Z2IiBwFNgxcKTq479l7yedYRGeU1A+SYI\nYmRFWHXt3rTkMlQSpxCsB0fAYfrwEqqISQQYEQIACQUCSzLkrgIbDAAKCRBVI7ru\nsB+hFpryAJ9qNz3h3ijt9TkAV0CHufsPT6Cl4gCglfg7tJn2lsSF3HTpoDDO1Fgg\nx9o=\n=AGYp\n-----END PGP PUBLIC KEY BLOCK-----\n" > /tmp/keys/1.key && apt-key add /tmp/keys/1.key 13:27:01 ---> Using cache 13:27:01 ---> da0f4ddae87c 13:27:01 Step 13 : RUN echo deb http://10.210.9.154/ubuntu/building xenial main | tee -a /etc/apt/sources.list.d/buildfarm.list 13:27:01 ---> Using cache 13:27:01 ---> 83d7fb748940 13:27:01 Step 14 : RUN echo deb http://packages.ros.org/ros/ubuntu xenial main | tee -a /etc/apt/sources.list.d/buildfarm.list 13:27:01 ---> Using cache 13:27:01 ---> 74c52aabe44a 13:27:01 Step 15 : RUN grep -q -F -e "deb http://old-releases.ubuntu.com" /etc/apt/sources.list && (echo "deb http://old-releases.ubuntu.com/ubuntu/ xenial multiverse" >> /etc/apt/sources.list && echo "deb-src http://old-releases.ubuntu.com/ubuntu/ xenial multiverse" >> /etc/apt/sources.list && echo "deb http://old-releases.ubuntu.com/ubuntu/ xenial-updates multiverse" >> /etc/apt/sources.list && echo "deb-src http://old-releases.ubuntu.com/ubuntu/ xenial-updates multiverse" >> /etc/apt/sources.list && echo "deb http://old-releases.ubuntu.com/ubuntu/ xenial-security multiverse" >> /etc/apt/sources.list && echo "deb-src http://old-releases.ubuntu.com/ubuntu/ xenial-security multiverse" >> /etc/apt/sources.list) || (echo "deb http://archive.ubuntu.com/ubuntu/ xenial multiverse" >> /etc/apt/sources.list && echo "deb-src http://archive.ubuntu.com/ubuntu/ xenial multiverse" >> /etc/apt/sources.list && echo "deb http://archive.ubuntu.com/ubuntu/ xenial-updates multiverse" >> /etc/apt/sources.list && echo "deb-src http://archive.ubuntu.com/ubuntu/ xenial-updates multiverse" >> /etc/apt/sources.list && echo "deb http://archive.ubuntu.com/ubuntu/ xenial-security multiverse" >> /etc/apt/sources.list && echo "deb-src http://archive.ubuntu.com/ubuntu/ xenial-security multiverse" >> /etc/apt/sources.list) 13:27:02 ---> Using cache 13:27:02 ---> dbd7b39d2461 13:27:02 Step 16 : RUN mkdir /tmp/wrapper_scripts 13:27:02 ---> Using cache 13:27:02 ---> 88d45a2c2565 13:27:02 Step 17 : RUN echo "#!/usr/bin/env python3\n\n# Copyright 2014-2016 Open Source Robotics Foundation, Inc.\n#\n# Licensed under the Apache License, Version 2.0 (the \"License\");\n# you may not use this file except in compliance with the License.\n# You may obtain a copy of the License at\n#\n# http://www.apache.org/licenses/LICENSE-2.0\n#\n# Unless required by applicable law or agreed to in writing, software\n# distributed under the License is distributed on an \"AS IS\" BASIS,\n# WITHOUT WARRANTIES OR CONDITIONS OF ANY KIND, either express or implied.\n# See the License for the specific language governing permissions and\n# limitations under the License.\n\nimport subprocess\nimport sys\nfrom time import sleep\n\n\ndef main(argv=sys.argv[1:]):\n max_tries = 10\n known_error_strings = [\n 'Failed to fetch',\n 'Hash Sum mismatch',\n 'Unable to locate package',\n 'is not what the server reported',\n ]\n\n command = argv[0]\n if command in ['update', 'source']:\n rc, _, _ = call_apt_repeatedly(\n argv, known_error_strings, max_tries)\n return rc\n elif command == 'update-install-clean':\n return call_apt_update_install_clean(\n argv[1:], known_error_strings, max_tries)\n else:\n assert \"Command '%s' not implemented\" % command\n\n\ndef call_apt_update_install_clean(\n install_argv, known_error_strings, max_tries):\n tries = 0\n command = 'update'\n while tries < max_tries:\n if command == 'update':\n rc, _, tries = call_apt_repeatedly(\n [command], known_error_strings, max_tries - tries,\n offset=tries)\n if rc != 0:\n # abort if update was unsuccessful even after retries\n break\n # move on to the install command if update was successful\n command = 'install'\n\n if command == 'install':\n # any call is considered a try\n tries += 1\n known_error_strings_redo_update = [\n 'Size mismatch',\n 'maybe run apt update',\n 'The following packages cannot be authenticated!',\n 'Unable to locate package',\n ]\n rc, known_error_conditions = \\\\\n call_apt(\n [command] + install_argv,\n known_error_strings + known_error_strings_redo_update)\n if not known_error_conditions:\n if rc != 0:\n # abort if install was unsuccessful\n break\n # move on to the clean command if install was successful\n command = 'clean'\n continue\n\n # known errors are always interpreted as a non-zero rc\n if rc == 0:\n rc = 1\n # check if update needs to be rerun\n if (\n set(known_error_conditions) &\n set(known_error_strings_redo_update)\n ):\n command = 'update'\n print(\"'apt install' failed and likely requires \" +\n \"'apt update' to run again\")\n # retry with update command\n continue\n\n print('Invocation failed due to the following known error '\n 'conditions: ' + ', '.join(known_error_conditions))\n if tries < max_tries:\n sleep_time = 5\n print(\"Reinvoke 'apt install' after sleeping %s seconds\" %\n sleep_time)\n sleep(sleep_time)\n # retry install command\n\n if command == 'clean':\n rc, _ = call_apt([command], [])\n break\n\n return rc\n\n\ndef call_apt_repeatedly(argv, known_error_strings, max_tries, offset=0):\n command = argv[0]\n for i in range(1, max_tries + 1):\n if i > 1:\n sleep_time = 5 + 2 * (i + offset)\n print(\"Reinvoke 'apt %s' (%d/%d) after sleeping %s seconds\" %\n (command, i + offset, max_tries + offset, sleep_time))\n sleep(sleep_time)\n rc, known_error_conditions = call_apt(argv, known_error_strings)\n if not known_error_conditions:\n # break the loop and return the reported rc\n break\n # known errors are always interpreted as a non-zero rc\n if rc == 0:\n rc = 1\n print('')\n print('Invocation failed due to the following known error conditions: '\n ', '.join(known_error_conditions))\n print('')\n # retry in case of failure with known error condition\n return rc, known_error_conditions, i + offset\n\n\ndef call_apt(argv, known_error_strings):\n known_error_conditions = []\n\n # some of the used options are not supported in older distros\n # e.g. Ubuntu Wily, Debian Jessie\n cmd = ['apt-get'] + argv\n print(\"Invoking '%s'\" % ' '.join(cmd))\n proc = subprocess.Popen(\n cmd, stdout=subprocess.PIPE, stderr=subprocess.STDOUT)\n lines = []\n while True:\n line = proc.stdout.readline()\n if not line:\n break\n line = line.decode()\n lines.append(line)\n sys.stdout.write(line)\n for known_error_string in known_error_strings:\n if known_error_string in line:\n if known_error_string not in known_error_conditions:\n known_error_conditions.append(known_error_string)\n proc.wait()\n rc = proc.returncode\n if rc and not known_error_conditions:\n print('Invocation failed without any known error condition, '\n 'printing all lines to debug known error detection:')\n for index, line in enumerate(lines):\n print(' ', index + 1, \"'%s'\" % line.rstrip('\\\\n\\\\r'))\n print('None of the following known errors were detected:')\n for index, known_error_string in enumerate(known_error_strings):\n print(' ', index + 1, \"'%s'\" % known_error_string)\n return rc, known_error_conditions\n\n\nif __name__ == '__main__':\n sys.exit(main())" > /tmp/wrapper_scripts/apt.py 13:27:02 ---> Using cache 13:27:02 ---> 0860ac724420 13:27:02 Step 18 : RUN echo "#!/usr/bin/env python3\n\n# Copyright 2016 Open Source Robotics Foundation, Inc.\n#\n# Licensed under the Apache License, Version 2.0 (the \"License\");\n# you may not use this file except in compliance with the License.\n# You may obtain a copy of the License at\n#\n# http://www.apache.org/licenses/LICENSE-2.0\n#\n# Unless required by applicable law or agreed to in writing, software\n# distributed under the License is distributed on an \"AS IS\" BASIS,\n# WITHOUT WARRANTIES OR CONDITIONS OF ANY KIND, either express or implied.\n# See the License for the specific language governing permissions and\n# limitations under the License.\n\nimport subprocess\nimport sys\nfrom time import sleep\n\n\ndef main(argv=sys.argv[1:]):\n max_tries = 10\n known_error_strings = [\n 'Connection timed out',\n ]\n\n command = argv[0]\n if command == 'clone':\n rc, _, _ = call_git_repeatedly(\n argv, known_error_strings, max_tries)\n return rc\n else:\n assert \"Command '%s' not implemented\" % command\n\n\ndef call_git_repeatedly(argv, known_error_strings, max_tries):\n command = argv[0]\n for i in range(1, max_tries + 1):\n if i > 1:\n sleep_time = 5 + 2 * i\n print(\"Reinvoke 'git %s' (%d/%d) after sleeping %s seconds\" %\n (command, i, max_tries, sleep_time))\n sleep(sleep_time)\n rc, known_error_conditions = call_git(argv, known_error_strings)\n if rc == 0 or not known_error_conditions:\n break\n print('')\n print('Invocation failed due to the following known error conditions: '\n ', '.join(known_error_conditions))\n print('')\n # retry in case of failure with known error condition\n return rc, known_error_conditions, i\n\n\ndef call_git(argv, known_error_strings):\n known_error_conditions = []\n\n cmd = ['git'] + argv\n print(\"Invoking '%s'\" % ' '.join(cmd))\n proc = subprocess.Popen(\n cmd, stdout=subprocess.PIPE, stderr=subprocess.STDOUT)\n while True:\n line = proc.stdout.readline()\n if not line:\n break\n line = line.decode()\n sys.stdout.write(line)\n for known_error_string in known_error_strings:\n if known_error_string in line:\n if known_error_string not in known_error_conditions:\n known_error_conditions.append(known_error_string)\n proc.wait()\n rc = proc.returncode\n return rc, known_error_conditions\n\n\nif __name__ == '__main__':\n sys.exit(main())" > /tmp/wrapper_scripts/git.py 13:27:03 ---> Using cache 13:27:03 ---> 0b9e5a0dab03 13:27:03 Step 19 : RUN echo "2018-07-24 (+0000)" 13:27:03 ---> Using cache 13:27:03 ---> 9a5e77f44a8b 13:27:03 Step 20 : RUN for i in 1 2 3; do apt-get update && apt-get install -q -y python3 && apt-get clean && break || if [[ $i < 3 ]]; then sleep 5; else false; fi; done 13:27:03 ---> Using cache 13:27:03 ---> a2dbc93cf5ce 13:27:03 Step 21 : RUN python3 -u /tmp/wrapper_scripts/apt.py update-install-clean -q -y ccache gcc build-essential 13:27:04 ---> Using cache 13:27:04 ---> 2382a64b9287 13:27:04 Step 22 : RUN echo "apt-src: 0.25.1-0.2" && echo "debhelper: 10.2.2ubuntu1~ubuntu16.04.1" && python3 -u /tmp/wrapper_scripts/apt.py update-install-clean -q -y -o Debug::pkgProblemResolver=yes apt-src debhelper 13:27:04 ---> Using cache 13:27:04 ---> 2e23c1324713 13:27:04 Step 23 : RUN echo "ros-kinetic-catkin: 0.7.11-0xenial-20180222-175501-0800" && echo "ros-kinetic-compressed-depth-image-transport: 1.9.5-0xenial-20180516-184736-0800" && echo "ros-kinetic-cv-bridge: 1.12.8-0xenial-20180516-152244-0800" && python3 -u /tmp/wrapper_scripts/apt.py update-install-clean -q -y -o Debug::pkgProblemResolver=yes ros-kinetic-catkin ros-kinetic-compressed-depth-image-transport ros-kinetic-cv-bridge 13:27:04 ---> Using cache 13:27:04 ---> 27e48eb3af37 13:27:04 Step 24 : RUN echo "ros-kinetic-kinect2-registration: 0.0.8-0xenial-20180724-115829+0000" && echo "ros-kinetic-libfreenect2: 0.0.8-0xenial-20180724-082945+0000" && echo "ros-kinetic-message-filters: 1.12.13-0xenial-20180222-225300-0800" && python3 -u /tmp/wrapper_scripts/apt.py update-install-clean -q -y -o Debug::pkgProblemResolver=yes ros-kinetic-kinect2-registration ros-kinetic-libfreenect2 ros-kinetic-message-filters 13:27:05 ---> Using cache 13:27:05 ---> 14296d5efcc4 13:27:05 Step 25 : RUN echo "ros-kinetic-nodelet: 1.9.14-0xenial-20180316-123613-0800" && echo "ros-kinetic-roscpp: 1.12.13-0xenial-20180222-205956-0800" && echo "ros-kinetic-rostime: 0.6.9-0xenial-20180222-192424-0800" && python3 -u /tmp/wrapper_scripts/apt.py update-install-clean -q -y -o Debug::pkgProblemResolver=yes ros-kinetic-nodelet ros-kinetic-roscpp ros-kinetic-rostime 13:27:05 ---> Using cache 13:27:05 ---> 6dbbe998d3de 13:27:05 Step 26 : RUN echo "ros-kinetic-sensor-msgs: 1.12.6-0xenial-20180516-133456-0800" && echo "ros-kinetic-std-msgs: 0.5.11-0xenial-20180222-195509-0800" && echo "ros-kinetic-tf: 1.11.9-0xenial-20180516-161707-0800" && python3 -u /tmp/wrapper_scripts/apt.py update-install-clean -q -y -o Debug::pkgProblemResolver=yes ros-kinetic-sensor-msgs ros-kinetic-std-msgs ros-kinetic-tf 13:27:05 ---> Using cache 13:27:05 ---> 07c477a3dc6b 13:27:05 Step 27 : USER buildfarm 13:27:06 ---> Using cache 13:27:06 ---> 46a0523d52c7 13:27:06 Step 28 : ENTRYPOINT sh -c 13:27:06 ---> Using cache 13:27:06 ---> be61ea819bc5 13:27:06 Step 29 : CMD PYTHONPATH=/tmp/ros_buildfarm:$PYTHONPATH PATH=/usr/lib/ccache:$PATH python3 -u /tmp/ros_buildfarm/scripts/release/build_binarydeb.py kinetic kinect2_bridge --sourcedeb-dir /tmp/binarydeb 13:27:07 ---> Using cache 13:27:07 ---> 75bfc225f99e 13:27:07 Successfully built 75bfc225f99e 13:27:07 + echo # END SECTION 13:27:07 # END SECTION
13:27:07 + echo # BEGIN SECTION: Run Dockerfile - build binarydeb
13. Run Dockerfile - build binarydeb

Hide Details

13:27:07 # BEGIN SECTION: Run Dockerfile - build binarydeb 13:27:07 + docker run --rm --cidfile=/home/jenkins-slave/workspace/Kbin_uX64__kinect2_bridge__ubuntu_xenial_amd64__binary/docker_build_binarydeb/docker.cid -e=HOME= -e=TRAVIS= --net=host -v /home/jenkins-slave/workspace/Kbin_uX64__kinect2_bridge__ubuntu_xenial_amd64__binary/ros_buildfarm:/tmp/ros_buildfarm:ro -v /home/jenkins-slave/workspace/Kbin_uX64__kinect2_bridge__ubuntu_xenial_amd64__binary/binarydeb:/tmp/binarydeb -v /home/jenkins-slave/.ccache:/home/buildfarm/.ccache binarydeb_build.kinetic_ubuntu_xenial_amd64_kinect2_bridge
13.1. build binarydeb

Hide Details

13:27:07 # BEGIN SUBSECTION: build binarydeb 13:27:07 Package 'ros-kinetic-kinect2-bridge' version: 0.0.8-0xenial-20180724-122648+0000 13:27:07 Target Packages (multiverse/binary-amd64/Packages) is configured multiple times in /etc/apt/sources.list:24 and /etc/apt/sources.list:50 13:27:07 Target Packages (multiverse/binary-all/Packages) is configured multiple times in /etc/apt/sources.list:24 and /etc/apt/sources.list:50 13:27:07 Target Packages (multiverse/binary-amd64/Packages) is configured multiple times in /etc/apt/sources.list:26 and /etc/apt/sources.list:52 13:27:07 Target Packages (multiverse/binary-all/Packages) is configured multiple times in /etc/apt/sources.list:26 and /etc/apt/sources.list:52 13:27:09 Target Packages (multiverse/binary-amd64/Packages) is configured multiple times in /etc/apt/sources.list:24 and /etc/apt/sources.list:50 13:27:09 Target Packages (multiverse/binary-all/Packages) is configured multiple times in /etc/apt/sources.list:24 and /etc/apt/sources.list:50 13:27:09 Target Packages (multiverse/binary-amd64/Packages) is configured multiple times in /etc/apt/sources.list:26 and /etc/apt/sources.list:52 13:27:09 Target Packages (multiverse/binary-all/Packages) is configured multiple times in /etc/apt/sources.list:26 and /etc/apt/sources.list:52 13:27:09 Invoking 'apt-src build ros-kinetic-kinect2-bridge' in '/tmp/binarydeb/ros-kinetic-kinect2-bridge-0.0.8' 13:27:09 Target Packages (multiverse/binary-amd64/Packages) is configured multiple times in /etc/apt/sources.list:24 and /etc/apt/sources.list:50 13:27:09 Target Packages (multiverse/binary-all/Packages) is configured multiple times in /etc/apt/sources.list:24 and /etc/apt/sources.list:50 13:27:09 Target Packages (multiverse/binary-amd64/Packages) is configured multiple times in /etc/apt/sources.list:26 and /etc/apt/sources.list:52 13:27:09 Target Packages (multiverse/binary-all/Packages) is configured multiple times in /etc/apt/sources.list:26 and /etc/apt/sources.list:52 13:27:10 Target Packages (multiverse/binary-amd64/Packages) is configured multiple times in /etc/apt/sources.list:24 and /etc/apt/sources.list:50 13:27:10 Target Packages (multiverse/binary-all/Packages) is configured multiple times in /etc/apt/sources.list:24 and /etc/apt/sources.list:50 13:27:10 Target Packages (multiverse/binary-amd64/Packages) is configured multiple times in /etc/apt/sources.list:26 and /etc/apt/sources.list:52 13:27:10 Target Packages (multiverse/binary-all/Packages) is configured multiple times in /etc/apt/sources.list:26 and /etc/apt/sources.list:52 13:27:10 I: Building in /tmp/binarydeb/ros-kinetic-kinect2-bridge-0.0.8 .. 13:27:11 dpkg-buildpackage: source package ros-kinetic-kinect2-bridge 13:27:11 dpkg-buildpackage: source version 0.0.8-0xenial-20180724-122648+0000 13:27:11 dpkg-buildpackage: source distribution xenial 13:27:11 dpkg-buildpackage: source changed by Manuel Fernandez-Carmona <mfernandezcarmona@lincoln.ac.uk> 13:27:11 dpkg-buildpackage: host architecture amd64 13:27:11 dpkg-source --before-build ros-kinetic-kinect2-bridge-0.0.8 13:27:11 dpkg-source: info: using options from ros-kinetic-kinect2-bridge-0.0.8/debian/source/options: --auto-commit 13:27:11 fakeroot debian/rules clean 13:27:11 dh clean -v --buildsystem=cmake 13:27:11 dh_testdir -O-v -O--buildsystem=cmake 13:27:12 dh_auto_clean -O-v -O--buildsystem=cmake 13:27:12 dh_clean -O-v -O--buildsystem=cmake 13:27:12 rm -f debian/debhelper-build-stamp 13:27:12 rm -f debian/ros-kinetic-kinect2-bridge.substvars 13:27:12 rm -f debian/ros-kinetic-kinect2-bridge.*.debhelper 13:27:12 rm -rf debian/ros-kinetic-kinect2-bridge/ 13:27:12 rm -rf debian/.debhelper/ 13:27:12 rm -f debian/*.debhelper.log 13:27:12 rm -f debian/files 13:27:12 find . \( \( \ 13:27:12 \( -path .\*/.git -o -path .\*/.svn -o -path .\*/.bzr -o -path .\*/.hg -o -path .\*/CVS \) -prune -o -type f -a \ 13:27:12 \( -name '#*#' -o -name '.*~' -o -name '*~' -o -name DEADJOE \ 13:27:12 -o -name '*.orig' -o -name '*.rej' -o -name '*.bak' \ 13:27:12 -o -name '.*.orig' -o -name .*.rej -o -name '.SUMS' \ 13:27:12 -o -name TAGS -o \( -path '*/.deps/*' -a -name '*.P' \) \ 13:27:12 \) -exec rm -f {} + \) -o \ 13:27:12 \( -type d -a -name autom4te.cache -prune -exec rm -rf {} + \) \) 13:27:12 rm -f *-stamp 13:27:12 debian/rules build 13:27:12 dh build -v --buildsystem=cmake 13:27:12 dh_testdir -O-v -O--buildsystem=cmake 13:27:12 dh_update_autotools_config -O-v -O--buildsystem=cmake 13:27:12 debian/rules override_dh_auto_configure 13:27:12 make[1]: Entering directory '/tmp/binarydeb/ros-kinetic-kinect2-bridge-0.0.8' 13:27:12 # In case we're installing to a non-standard location, look for a setup.sh 13:27:12 # in the install tree that was dropped by catkin, and source it. It will 13:27:12 # set things like CMAKE_PREFIX_PATH, PKG_CONFIG_PATH, and PYTHONPATH. 13:27:12 if [ -f "/opt/ros/kinetic/setup.sh" ]; then . "/opt/ros/kinetic/setup.sh"; fi && \ 13:27:12 dh_auto_configure -- \ 13:27:12 -DCATKIN_BUILD_BINARY_PACKAGE="1" \ 13:27:12 -DCMAKE_INSTALL_PREFIX="/opt/ros/kinetic" \ 13:27:12 -DCMAKE_PREFIX_PATH="/opt/ros/kinetic" 13:27:12 mkdir -p obj-x86_64-linux-gnu 13:27:12 cd obj-x86_64-linux-gnu 13:27:12 cmake .. -DCMAKE_INSTALL_PREFIX=/usr -DCMAKE_VERBOSE_MAKEFILE=ON -DCMAKE_BUILD_TYPE=None -DCMAKE_INSTALL_SYSCONFDIR=/etc -DCMAKE_INSTALL_LOCALSTATEDIR=/var -DCATKIN_BUILD_BINARY_PACKAGE=1 -DCMAKE_INSTALL_PREFIX=/opt/ros/kinetic -DCMAKE_PREFIX_PATH=/opt/ros/kinetic 13:27:12 -- The CXX compiler identification is GNU 5.4.0 13:27:12 -- Check for working CXX compiler: /usr/lib/ccache/x86_64-linux-gnu-g++ 13:27:12 -- Check for working CXX compiler: /usr/lib/ccache/x86_64-linux-gnu-g++ -- works 13:27:12 -- Detecting CXX compiler ABI info 13:27:13 -- Detecting CXX compiler ABI info - done 13:27:13 -- Detecting CXX compile features 13:27:13 -- Detecting CXX compile features - done 13:27:13 -- Performing Test COMPILER_SUPPORTS_CXX11 13:27:13 -- Performing Test COMPILER_SUPPORTS_CXX11 - Success 13:27:13 -- Performing Test COMPILER_SUPPORTS_CXX0X 13:27:13 -- Performing Test COMPILER_SUPPORTS_CXX0X - Success 13:27:13 -- Using CATKIN_DEVEL_PREFIX: /tmp/binarydeb/ros-kinetic-kinect2-bridge-0.0.8/obj-x86_64-linux-gnu/devel 13:27:13 -- Using CMAKE_PREFIX_PATH: /opt/ros/kinetic 13:27:13 -- This workspace overlays: /opt/ros/kinetic 13:27:13 -- Found PythonInterp: /usr/bin/python (found version "2.7.12") 13:27:13 -- Using PYTHON_EXECUTABLE: /usr/bin/python 13:27:13 -- Using Debian Python package layout 13:27:13 -- Using empy: /usr/bin/empy 13:27:14 -- Using CATKIN_ENABLE_TESTING: ON 13:27:14 -- Skip enable_testing() when building binary package 13:27:14 -- Using CATKIN_TEST_RESULTS_DIR: /tmp/binarydeb/ros-kinetic-kinect2-bridge-0.0.8/obj-x86_64-linux-gnu/test_results 13:27:14 -- Found gmock sources under '/usr/src/gmock': gmock will be built 13:27:14 -- The C compiler identification is GNU 5.4.0 13:27:14 -- Check for working C compiler: /usr/lib/ccache/x86_64-linux-gnu-gcc 13:27:14 -- Check for working C compiler: /usr/lib/ccache/x86_64-linux-gnu-gcc -- works 13:27:14 -- Detecting C compiler ABI info 13:27:14 -- Detecting C compiler ABI info - done 13:27:14 -- Detecting C compile features 13:27:14 -- Detecting C compile features - done 13:27:14 -- Looking for pthread.h 13:27:14 -- Looking for pthread.h - found 13:27:14 -- Looking for pthread_create 13:27:15 -- Looking for pthread_create - not found 13:27:15 -- Looking for pthread_create in pthreads 13:27:15 -- Looking for pthread_create in pthreads - not found 13:27:15 -- Looking for pthread_create in pthread 13:27:15 -- Looking for pthread_create in pthread - found 13:27:15 -- Found Threads: TRUE 13:27:15 -- Found gtest sources under '/usr/src/gmock': gtests will be built 13:27:15 -- Using Python nosetests: /usr/bin/nosetests-2.7 13:27:15 -- catkin 0.7.11 13:27:15 -- Using these message generators: gencpp;geneus;genlisp;gennodejs;genpy 13:27:16 -- Found OpenCV: /opt/ros/kinetic (found version "3.3.1") 13:27:16 -- Configuring done 13:27:16 CMake Error at CMakeLists.txt:61 (add_custom_target): 13:27:16 Cannot find source file: 13:27:16 13:27:16 /tmp/binarydeb/README.md 13:27:16 13:27:16 Tried extensions .c .C .c++ .cc .cpp .cxx .m .M .mm .h .hh .h++ .hm .hpp 13:27:16 .hxx .in .txx 13:27:16 13:27:16 13:27:16 -- Generating done 13:27:16 -- Build files have been written to: /tmp/binarydeb/ros-kinetic-kinect2-bridge-0.0.8/obj-x86_64-linux-gnu 13:27:16 CMake Warning: 13:27:16 Manually-specified variables were not used by the project: 13:27:16 13:27:16 CMAKE_INSTALL_LOCALSTATEDIR 13:27:16 CMAKE_INSTALL_SYSCONFDIR 13:27:16 13:27:16 13:27:16 cd /tmp/binarydeb/ros-kinetic-kinect2-bridge-0.0.8 13:27:16 cd obj-x86_64-linux-gnu 13:27:16 "tail -v -n +0 CMakeCache.txt" 13:27:16 ==> CMakeCache.txt <== 13:27:16 # This is the CMakeCache file. 13:27:16 # For build in directory: /tmp/binarydeb/ros-kinetic-kinect2-bridge-0.0.8/obj-x86_64-linux-gnu 13:27:16 # It was generated by CMake: /usr/bin/cmake 13:27:16 # You can edit this file to change values found and used by cmake. 13:27:16 # If you do not want to change any of the values, simply exit the editor. 13:27:16 # If you do want to change a value, simply edit, save, and exit the editor. 13:27:16 # The syntax for the file is as follows: 13:27:16 # KEY:TYPE=VALUE 13:27:16 # KEY is the name of a variable in the cache. 13:27:16 # TYPE is a hint to GUIs for the type of VALUE, DO NOT EDIT TYPE!. 13:27:16 # VALUE is the current value for the KEY. 13:27:16 13:27:16 ######################## 13:27:16 # EXTERNAL cache entries 13:27:16 ######################## 13:27:16 13:27:16 //Build shared libraries (DLLs). 13:27:16 BUILD_SHARED_LIBS:BOOL=ON 13:27:16 13:27:16 //No help, variable specified on the command line. 13:27:16 CATKIN_BUILD_BINARY_PACKAGE:UNINITIALIZED=1 13:27:16 13:27:16 //Catkin enable testing 13:27:16 CATKIN_ENABLE_TESTING:BOOL=ON 13:27:16 13:27:16 //Prefix to apply to package generated via gendebian 13:27:16 CATKIN_PACKAGE_PREFIX:STRING= 13:27:16 13:27:16 //Catkin skip testing 13:27:16 CATKIN_SKIP_TESTING:BOOL=OFF 13:27:16 13:27:16 //Path to a program. 13:27:16 CMAKE_AR:FILEPATH=/usr/bin/ar 13:27:16 13:27:16 //Choose the type of build, options are: None(CMAKE_CXX_FLAGS or 13:27:16 // CMAKE_C_FLAGS used) Debug Release RelWithDebInfo MinSizeRel. 13:27:16 CMAKE_BUILD_TYPE:STRING=None 13:27:16 13:27:16 //Enable/Disable color output during build. 13:27:16 CMAKE_COLOR_MAKEFILE:BOOL=ON 13:27:16 13:27:16 //Path to a program. 13:27:16 CMAKE_CXX_COMPILER:FILEPATH=/usr/lib/ccache/x86_64-linux-gnu-g++ 13:27:16 13:27:16 //Flags used by the compiler during all build types. 13:27:16 CMAKE_CXX_FLAGS:STRING='-g -O2 -fstack-protector-strong -Wformat -Werror=format-security -DNDEBUG -Wdate-time -D_FORTIFY_SOURCE=2 ' 13:27:16 13:27:16 //Flags used by the compiler during debug builds. 13:27:16 CMAKE_CXX_FLAGS_DEBUG:STRING=-g 13:27:16 13:27:16 //Flags used by the compiler during release builds for minimum 13:27:16 // size. 13:27:16 CMAKE_CXX_FLAGS_MINSIZEREL:STRING=-Os -DNDEBUG 13:27:16 13:27:16 //Flags used by the compiler during release builds. 13:27:16 CMAKE_CXX_FLAGS_RELEASE:STRING=-O3 -DNDEBUG 13:27:16 13:27:16 //Flags used by the compiler during release builds with debug info. 13:27:16 CMAKE_CXX_FLAGS_RELWITHDEBINFO:STRING=-O2 -g -DNDEBUG 13:27:16 13:27:16 //Path to a program. 13:27:16 CMAKE_C_COMPILER:FILEPATH=/usr/lib/ccache/x86_64-linux-gnu-gcc 13:27:16 13:27:16 //Flags used by the compiler during all build types. 13:27:16 CMAKE_C_FLAGS:STRING='-g -O2 -fstack-protector-strong -Wformat -Werror=format-security -Wdate-time -D_FORTIFY_SOURCE=2 ' 13:27:16 13:27:16 //Flags used by the compiler during debug builds. 13:27:16 CMAKE_C_FLAGS_DEBUG:STRING=-g 13:27:16 13:27:16 //Flags used by the compiler during release builds for minimum 13:27:16 // size. 13:27:16 CMAKE_C_FLAGS_MINSIZEREL:STRING=-Os -DNDEBUG 13:27:16 13:27:16 //Flags used by the compiler during release builds. 13:27:16 CMAKE_C_FLAGS_RELEASE:STRING=-O3 -DNDEBUG 13:27:16 13:27:16 //Flags used by the compiler during release builds with debug info. 13:27:16 CMAKE_C_FLAGS_RELWITHDEBINFO:STRING=-O2 -g -DNDEBUG 13:27:16 13:27:16 //Flags used by the linker. 13:27:16 CMAKE_EXE_LINKER_FLAGS:STRING= 13:27:16 13:27:16 //Flags used by the linker during debug builds. 13:27:16 CMAKE_EXE_LINKER_FLAGS_DEBUG:STRING= 13:27:16 13:27:16 //Flags used by the linker during release minsize builds. 13:27:16 CMAKE_EXE_LINKER_FLAGS_MINSIZEREL:STRING= 13:27:16 13:27:16 //Flags used by the linker during release builds. 13:27:16 CMAKE_EXE_LINKER_FLAGS_RELEASE:STRING= 13:27:16 13:27:16 //Flags used by the linker during Release with Debug Info builds. 13:27:16 CMAKE_EXE_LINKER_FLAGS_RELWITHDEBINFO:STRING= 13:27:16 13:27:16 //Enable/Disable output of compile commands during generation. 13:27:16 CMAKE_EXPORT_COMPILE_COMMANDS:BOOL=OFF 13:27:16 13:27:16 //Path to a program. 13:27:16 CMAKE_Fortran_COMPILER:FILEPATH=CMAKE_Fortran_COMPILER-NOTFOUND 13:27:16 13:27:16 //No help, variable specified on the command line. 13:27:16 CMAKE_INSTALL_LOCALSTATEDIR:UNINITIALIZED=/var 13:27:16 13:27:16 //Install path prefix, prepended onto install directories. 13:27:16 CMAKE_INSTALL_PREFIX:PATH=/opt/ros/kinetic 13:27:16 13:27:16 //No help, variable specified on the command line. 13:27:16 CMAKE_INSTALL_SYSCONFDIR:UNINITIALIZED=/etc 13:27:16 13:27:16 //Path to a program. 13:27:16 CMAKE_LINKER:FILEPATH=/usr/bin/ld 13:27:16 13:27:16 //Path to a program. 13:27:16 CMAKE_MAKE_PROGRAM:FILEPATH=/usr/bin/make 13:27:16 13:27:16 //Flags used by the linker during the creation of modules. 13:27:16 CMAKE_MODULE_LINKER_FLAGS:STRING= 13:27:16 13:27:16 //Flags used by the linker during debug builds. 13:27:16 CMAKE_MODULE_LINKER_FLAGS_DEBUG:STRING= 13:27:16 13:27:16 //Flags used by the linker during release minsize builds. 13:27:16 CMAKE_MODULE_LINKER_FLAGS_MINSIZEREL:STRING= 13:27:16 13:27:16 //Flags used by the linker during release builds. 13:27:16 CMAKE_MODULE_LINKER_FLAGS_RELEASE:STRING= 13:27:16 13:27:16 //Flags used by the linker during Release with Debug Info builds. 13:27:16 CMAKE_MODULE_LINKER_FLAGS_RELWITHDEBINFO:STRING= 13:27:16 13:27:16 //Path to a program. 13:27:16 CMAKE_NM:FILEPATH=/usr/bin/nm 13:27:16 13:27:16 //Path to a program. 13:27:16 CMAKE_OBJCOPY:FILEPATH=/usr/bin/objcopy 13:27:16 13:27:16 //Path to a program. 13:27:16 CMAKE_OBJDUMP:FILEPATH=/usr/bin/objdump 13:27:16 13:27:16 //No help, variable specified on the command line. 13:27:16 CMAKE_PREFIX_PATH:UNINITIALIZED=/opt/ros/kinetic 13:27:16 13:27:16 //Value Computed by CMake 13:27:16 CMAKE_PROJECT_NAME:STATIC=kinect2_bridge 13:27:16 13:27:16 //Path to a program. 13:27:16 CMAKE_RANLIB:FILEPATH=/usr/bin/ranlib 13:27:16 13:27:16 //Flags used by the linker during the creation of dll's. 13:27:16 CMAKE_SHARED_LINKER_FLAGS:STRING= 13:27:16 13:27:16 //Flags used by the linker during debug builds. 13:27:16 CMAKE_SHARED_LINKER_FLAGS_DEBUG:STRING= 13:27:16 13:27:16 //Flags used by the linker during release minsize builds. 13:27:16 CMAKE_SHARED_LINKER_FLAGS_MINSIZEREL:STRING= 13:27:16 13:27:16 //Flags used by the linker during release builds. 13:27:16 CMAKE_SHARED_LINKER_FLAGS_RELEASE:STRING= 13:27:16 13:27:16 //Flags used by the linker during Release with Debug Info builds. 13:27:16 CMAKE_SHARED_LINKER_FLAGS_RELWITHDEBINFO:STRING= 13:27:16 13:27:16 //If set, runtime paths are not added when installing shared libraries, 13:27:16 // but are added when building. 13:27:16 CMAKE_SKIP_INSTALL_RPATH:BOOL=NO 13:27:16 13:27:16 //If set, runtime paths are not added when using shared libraries. 13:27:16 CMAKE_SKIP_RPATH:BOOL=NO 13:27:16 13:27:16 //Flags used by the linker during the creation of static libraries. 13:27:16 CMAKE_STATIC_LINKER_FLAGS:STRING= 13:27:16 13:27:16 //Flags used by the linker during debug builds. 13:27:16 CMAKE_STATIC_LINKER_FLAGS_DEBUG:STRING= 13:27:16 13:27:16 //Flags used by the linker during release minsize builds. 13:27:16 CMAKE_STATIC_LINKER_FLAGS_MINSIZEREL:STRING= 13:27:16 13:27:16 //Flags used by the linker during release builds. 13:27:16 CMAKE_STATIC_LINKER_FLAGS_RELEASE:STRING= 13:27:16 13:27:16 //Flags used by the linker during Release with Debug Info builds. 13:27:16 CMAKE_STATIC_LINKER_FLAGS_RELWITHDEBINFO:STRING= 13:27:16 13:27:16 //Path to a program. 13:27:16 CMAKE_STRIP:FILEPATH=/usr/bin/strip 13:27:16 13:27:16 //If this value is on, makefiles will be generated without the 13:27:16 // .SILENT directive, and all commands will be echoed to the console 13:27:16 // during the make. This is useful for debugging only. With Visual 13:27:16 // Studio IDE projects all commands are done without /nologo. 13:27:16 CMAKE_VERBOSE_MAKEFILE:BOOL=ON 13:27:16 13:27:16 //Path to a program. 13:27:16 DOXYGEN_EXECUTABLE:FILEPATH=DOXYGEN_EXECUTABLE-NOTFOUND 13:27:16 13:27:16 //Path to a program. 13:27:16 EMPY_EXECUTABLE:FILEPATH=/usr/bin/empy 13:27:16 13:27:16 //Empy script 13:27:16 EMPY_SCRIPT:STRING=/usr/bin/empy 13:27:16 13:27:16 //The directory containing a CMake configuration file for GMock. 13:27:16 GMock_DIR:PATH=GMock_DIR-NOTFOUND 13:27:16 13:27:16 //Path to a file. 13:27:16 GTEST_INCLUDE_DIR:PATH=/usr/include 13:27:16 13:27:16 //Path to a library. 13:27:16 GTEST_LIBRARY:FILEPATH=GTEST_LIBRARY-NOTFOUND 13:27:16 13:27:16 //Path to a library. 13:27:16 GTEST_LIBRARY_DEBUG:FILEPATH=GTEST_LIBRARY_DEBUG-NOTFOUND 13:27:16 13:27:16 //Path to a library. 13:27:16 GTEST_MAIN_LIBRARY:FILEPATH=GTEST_MAIN_LIBRARY-NOTFOUND 13:27:16 13:27:16 //Path to a library. 13:27:16 GTEST_MAIN_LIBRARY_DEBUG:FILEPATH=GTEST_MAIN_LIBRARY_DEBUG-NOTFOUND 13:27:16 13:27:16 //lsb_release executable was found 13:27:16 LSB_FOUND:BOOL=TRUE 13:27:16 13:27:16 //Path to a program. 13:27:16 LSB_RELEASE_EXECUTABLE:FILEPATH=/usr/bin/lsb_release 13:27:16 13:27:16 //Path to a program. 13:27:16 NOSETESTS:FILEPATH=/usr/bin/nosetests-2.7 13:27:16 13:27:16 //The directory containing a CMake configuration file for OpenCV. 13:27:16 OpenCV_DIR:PATH=/opt/ros/kinetic/share/OpenCV-3.3.1-dev 13:27:16 13:27:16 //Path to a program. 13:27:16 PYTHON_EXECUTABLE:FILEPATH=/usr/bin/python 13:27:16 13:27:16 //Specify specific Python version to use ('major.minor' or 'major') 13:27:16 PYTHON_VERSION:STRING= 13:27:16 13:27:16 //Path to a library. 13:27:16 RT_LIBRARY:FILEPATH=/usr/lib/x86_64-linux-gnu/librt.so 13:27:16 13:27:16 //Enable debian style python package layout 13:27:16 SETUPTOOLS_DEB_LAYOUT:BOOL=ON 13:27:16 13:27:16 //LSB Distrib tag 13:27:16 UBUNTU:BOOL=TRUE 13:27:16 13:27:16 //LSB Distrib - codename tag 13:27:16 UBUNTU_XENIAL:BOOL=TRUE 13:27:16 13:27:16 //Path to a file. 13:27:16 _gmock_INCLUDES:FILEPATH=/usr/include/gmock/gmock.h 13:27:16 13:27:16 //Path to a file. 13:27:16 _gmock_SOURCES:FILEPATH=/usr/src/gmock/src/gmock.cc 13:27:16 13:27:16 //Path to a file. 13:27:16 _gtest_INCLUDES:FILEPATH=/usr/include/gtest/gtest.h 13:27:16 13:27:16 //Path to a file. 13:27:16 _gtest_SOURCES:FILEPATH=/usr/src/gtest/src/gtest.cc 13:27:16 13:27:16 //The directory containing a CMake configuration file for actionlib. 13:27:16 actionlib_DIR:PATH=/opt/ros/kinetic/share/actionlib/cmake 13:27:16 13:27:16 //The directory containing a CMake configuration file for actionlib_msgs. 13:27:16 actionlib_msgs_DIR:PATH=/opt/ros/kinetic/share/actionlib_msgs/cmake 13:27:16 13:27:16 //The directory containing a CMake configuration file for bond. 13:27:16 bond_DIR:PATH=/opt/ros/kinetic/share/bond/cmake 13:27:16 13:27:16 //The directory containing a CMake configuration file for bondcpp. 13:27:16 bondcpp_DIR:PATH=/opt/ros/kinetic/share/bondcpp/cmake 13:27:16 13:27:16 //The directory containing a CMake configuration file for catkin. 13:27:16 catkin_DIR:PATH=/opt/ros/kinetic/share/catkin/cmake 13:27:16 13:27:16 //The directory containing a CMake configuration file for class_loader. 13:27:16 class_loader_DIR:PATH=/opt/ros/kinetic/share/class_loader/cmake 13:27:16 13:27:16 //The directory containing a CMake configuration file for compressed_depth_image_transport. 13:27:16 compressed_depth_image_transport_DIR:PATH=/opt/ros/kinetic/share/compressed_depth_image_transport/cmake 13:27:16 13:27:16 //The directory containing a CMake configuration file for cpp_common. 13:27:16 cpp_common_DIR:PATH=/opt/ros/kinetic/share/cpp_common/cmake 13:27:16 13:27:16 //The directory containing a CMake configuration file for cv_bridge. 13:27:16 cv_bridge_DIR:PATH=/opt/ros/kinetic/share/cv_bridge/cmake 13:27:16 13:27:16 //The directory containing a CMake configuration file for dynamic_reconfigure. 13:27:16 dynamic_reconfigure_DIR:PATH=/opt/ros/kinetic/share/dynamic_reconfigure/cmake 13:27:16 13:27:16 //The directory containing a CMake configuration file for freenect2. 13:27:16 freenect2_DIR:PATH=/opt/ros/kinetic/lib/cmake/freenect2 13:27:16 13:27:16 //Path to a file. 13:27:16 freenect2_INCLUDE_DIR:PATH=/opt/ros/kinetic/include 13:27:16 13:27:16 //Path to a library. 13:27:16 freenect2_LIBRARY:FILEPATH=/opt/ros/kinetic/lib/libfreenect2.so 13:27:16 13:27:16 //The directory containing a CMake configuration file for gencpp. 13:27:16 gencpp_DIR:PATH=/opt/ros/kinetic/share/gencpp/cmake 13:27:16 13:27:16 //The directory containing a CMake configuration file for geneus. 13:27:16 geneus_DIR:PATH=/opt/ros/kinetic/share/geneus/cmake 13:27:16 13:27:16 //The directory containing a CMake configuration file for genlisp. 13:27:16 genlisp_DIR:PATH=/opt/ros/kinetic/share/genlisp/cmake 13:27:16 13:27:16 //The directory containing a CMake configuration file for genmsg. 13:27:16 genmsg_DIR:PATH=/opt/ros/kinetic/share/genmsg/cmake 13:27:16 13:27:16 //The directory containing a CMake configuration file for gennodejs. 13:27:16 gennodejs_DIR:PATH=/opt/ros/kinetic/share/gennodejs/cmake 13:27:16 13:27:16 //The directory containing a CMake configuration file for genpy. 13:27:16 genpy_DIR:PATH=/opt/ros/kinetic/share/genpy/cmake 13:27:16 13:27:16 //The directory containing a CMake configuration file for geometry_msgs. 13:27:16 geometry_msgs_DIR:PATH=/opt/ros/kinetic/share/geometry_msgs/cmake 13:27:16 13:27:16 //Value Computed by CMake 13:27:16 gmock_BINARY_DIR:STATIC=/tmp/binarydeb/ros-kinetic-kinect2-bridge-0.0.8/obj-x86_64-linux-gnu/gtest 13:27:16 13:27:16 //Dependencies for the target 13:27:16 gmock_LIB_DEPENDS:STATIC=general;-lpthread; 13:27:16 13:27:16 //Value Computed by CMake 13:27:16 gmock_SOURCE_DIR:STATIC=/usr/src/gmock 13:27:16 13:27:16 //Build all of Google Mock's own tests. 13:27:16 gmock_build_tests:BOOL=OFF 13:27:16 13:27:16 //Dependencies for the target 13:27:16 gmock_main_LIB_DEPENDS:STATIC=general;-lpthread; 13:27:16 13:27:16 //Value Computed by CMake 13:27:16 gtest_BINARY_DIR:STATIC=/tmp/binarydeb/ros-kinetic-kinect2-bridge-0.0.8/obj-x86_64-linux-gnu/gtest/gtest 13:27:16 13:27:16 //Dependencies for the target 13:27:16 gtest_LIB_DEPENDS:STATIC=general;-lpthread; 13:27:16 13:27:16 //Value Computed by CMake 13:27:16 gtest_SOURCE_DIR:STATIC=/usr/src/gtest 13:27:16 13:27:16 //Build gtest's sample programs. 13:27:16 gtest_build_samples:BOOL=OFF 13:27:16 13:27:16 //Build all of gtest's own tests. 13:27:16 gtest_build_tests:BOOL=OFF 13:27:16 13:27:16 //Disable uses of pthreads in gtest. 13:27:16 gtest_disable_pthreads:BOOL=OFF 13:27:16 13:27:16 //Use shared (DLL) run-time lib even when Google Test is built 13:27:16 // as static lib. 13:27:16 gtest_force_shared_crt:BOOL=OFF 13:27:16 13:27:16 //Dependencies for the target 13:27:16 gtest_main_LIB_DEPENDS:STATIC=general;-lpthread;general;gtest; 13:27:16 13:27:16 //The directory containing a CMake configuration file for image_transport. 13:27:16 image_transport_DIR:PATH=/opt/ros/kinetic/share/image_transport/cmake 13:27:16 13:27:16 //Value Computed by CMake 13:27:16 kinect2_bridge_BINARY_DIR:STATIC=/tmp/binarydeb/ros-kinetic-kinect2-bridge-0.0.8/obj-x86_64-linux-gnu 13:27:16 13:27:16 //Value Computed by CMake 13:27:16 kinect2_bridge_SOURCE_DIR:STATIC=/tmp/binarydeb/ros-kinetic-kinect2-bridge-0.0.8 13:27:16 13:27:16 //Dependencies for the target 13:27:16 kinect2_bridge_nodelet_LIB_DEPENDS:STATIC=general;/opt/ros/kinetic/lib/libtf.so;general;/opt/ros/kinetic/lib/libtf2_ros.so;general;/opt/ros/kinetic/lib/libactionlib.so;general;/opt/ros/kinetic/lib/libtf2.so;general;/opt/ros/kinetic/lib/libnodeletlib.so;general;/opt/ros/kinetic/lib/libbondcpp.so;general;/usr/lib/x86_64-linux-gnu/libuuid.so;general;/opt/ros/kinetic/lib/libcompressed_depth_image_transport.so;general;/opt/ros/kinetic/lib/x86_64-linux-gnu/libopencv_calib3d3.so.3.3.1;general;/opt/ros/kinetic/lib/x86_64-linux-gnu/libopencv_dnn3.so.3.3.1;general;/opt/ros/kinetic/lib/x86_64-linux-gnu/libopencv_features2d3.so.3.3.1;general;/opt/ros/kinetic/lib/x86_64-linux-gnu/libopencv_flann3.so.3.3.1;general;/opt/ros/kinetic/lib/x86_64-linux-gnu/libopencv_highgui3.so.3.3.1;general;/opt/ros/kinetic/lib/x86_64-linux-gnu/libopencv_ml3.so.3.3.1;general;/opt/ros/kinetic/lib/x86_64-linux-gnu/libopencv_objdetect3.so.3.3.1;general;/opt/ros/kinetic/lib/x86_64-linux-gnu/libopencv_photo3.so.3.3.1;general;/opt/ros/kinetic/lib/x86_64-linux-gnu/libopencv_shape3.so.3.3.1;general;/opt/ros/kinetic/lib/x86_64-linux-gnu/libopencv_stitching3.so.3.3.1;general;/opt/ros/kinetic/lib/x86_64-linux-gnu/libopencv_superres3.so.3.3.1;general;/opt/ros/kinetic/lib/x86_64-linux-gnu/libopencv_video3.so.3.3.1;general;/opt/ros/kinetic/lib/x86_64-linux-gnu/libopencv_videoio3.so.3.3.1;general;/opt/ros/kinetic/lib/x86_64-linux-gnu/libopencv_videostab3.so.3.3.1;general;/opt/ros/kinetic/lib/x86_64-linux-gnu/libopencv_viz3.so.3.3.1;general;/opt/ros/kinetic/lib/x86_64-linux-gnu/libopencv_aruco3.so.3.3.1;general;/opt/ros/kinetic/lib/x86_64-linux-gnu/libopencv_bgsegm3.so.3.3.1;general;/opt/ros/kinetic/lib/x86_64-linux-gnu/libopencv_bioinspired3.so.3.3.1;general;/opt/ros/kinetic/lib/x86_64-linux-gnu/libopencv_ccalib3.so.3.3.1;general;/opt/ros/kinetic/lib/x86_64-linux-gnu/libopencv_cvv3.so.3.3.1;general;/opt/ros/kinetic/lib/x86_64-linux-gnu/libopencv_datasets3.so.3.3.1;general;/opt/ros/kinetic/lib/x86_64-linux-gnu/libopencv_dpm3.so.3.3.1;general;/opt/ros/kinetic/lib/x86_64-linux-gnu/libopencv_face3.so.3.3.1;general;/opt/ros/kinetic/lib/x86_64-linux-gnu/libopencv_fuzzy3.so.3.3.1;general;/opt/ros/kinetic/lib/x86_64-linux-gnu/libopencv_hdf3.so.3.3.1;general;/opt/ros/kinetic/lib/x86_64-linux-gnu/libopencv_img_hash3.so.3.3.1;general;/opt/ros/kinetic/lib/x86_64-linux-gnu/libopencv_line_descriptor3.so.3.3.1;general;/opt/ros/kinetic/lib/x86_64-linux-gnu/libopencv_optflow3.so.3.3.1;general;/opt/ros/kinetic/lib/x86_64-linux-gnu/libopencv_phase_unwrapping3.so.3.3.1;general;/opt/ros/kinetic/lib/x86_64-linux-gnu/libopencv_plot3.so.3.3.1;general;/opt/ros/kinetic/lib/x86_64-linux-gnu/libopencv_reg3.so.3.3.1;general;/opt/ros/kinetic/lib/x86_64-linux-gnu/libopencv_rgbd3.so.3.3.1;general;/opt/ros/kinetic/lib/x86_64-linux-gnu/libopencv_saliency3.so.3.3.1;general;/opt/ros/kinetic/lib/x86_64-linux-gnu/libopencv_stereo3.so.3.3.1;general;/opt/ros/kinetic/lib/x86_64-linux-gnu/libopencv_structured_light3.so.3.3.1;general;/opt/ros/kinetic/lib/x86_64-linux-gnu/libopencv_surface_matching3.so.3.3.1;general;/opt/ros/kinetic/lib/x86_64-linux-gnu/libopencv_text3.so.3.3.1;general;/opt/ros/kinetic/lib/x86_64-linux-gnu/libopencv_tracking3.so.3.3.1;general;/opt/ros/kinetic/lib/x86_64-linux-gnu/libopencv_xfeatures2d3.so.3.3.1;general;/opt/ros/kinetic/lib/x86_64-linux-gnu/libopencv_ximgproc3.so.3.3.1;general;/opt/ros/kinetic/lib/x86_64-linux-gnu/libopencv_xobjdetect3.so.3.3.1;general;/opt/ros/kinetic/lib/x86_64-linux-gnu/libopencv_xphoto3.so.3.3.1;general;/opt/ros/kinetic/lib/libcv_bridge.so;general;/opt/ros/kinetic/lib/x86_64-linux-gnu/libopencv_core3.so.3.3.1;general;/opt/ros/kinetic/lib/x86_64-linux-gnu/libopencv_imgproc3.so.3.3.1;general;/opt/ros/kinetic/lib/x86_64-linux-gnu/libopencv_imgcodecs3.so.3.3.1;general;/opt/ros/kinetic/lib/libdynamic_reconfigure_config_init_mutex.so;general;/opt/ros/kinetic/lib/libimage_transport.so;general;/opt/ros/kinetic/lib/libmessage_filters.so;general;/usr/lib/x86_64-linux-gnu/libtinyxml2.so;general;/opt/ros/kinetic/lib/libclass_loader.so;general;/usr/lib/libPocoFoundation.so;general;/usr/lib/x86_64-linux-gnu/libdl.so;general;/opt/ros/kinetic/lib/libroscpp.so;general;/usr/lib/x86_64-linux-gnu/libboost_signals.so;general;/opt/ros/kinetic/lib/librosconsole.so;general;/opt/ros/kinetic/lib/librosconsole_log4cxx.so;general;/opt/ros/kinetic/lib/librosconsole_backend_interface.so;general;/usr/lib/x86_64-linux-gnu/liblog4cxx.so;general;/usr/lib/x86_64-linux-gnu/libboost_regex.so;general;/opt/ros/kinetic/lib/libxmlrpcpp.so;general;/opt/ros/kinetic/lib/libroslib.so;general;/opt/ros/kinetic/lib/librospack.so;general;/usr/lib/x86_64-linux-gnu/libpython2.7.so;general;/usr/lib/x86_64-linux-gnu/libboost_filesystem.so;general;/usr/lib/x86_64-linux-gnu/libboost_program_options.so;general;/usr/lib/x86_64-linux-gnu/libtinyxml.so;general;/opt/ros/kinetic/lib/libroscpp_serialization.so;general;/opt/ros/kinetic/lib/librostime.so;general;/opt/ros/kinetic/lib/libcpp_common.so;general;/usr/lib/x86_64-linux-gnu/libboost_system.so;general;/usr/lib/x86_64-linux-gnu/libboost_thread.so;general;/usr/lib/x86_64-linux-gnu/libboost_chrono.so;general;/usr/lib/x86_64-linux-gnu/libboost_date_time.so;general;/usr/lib/x86_64-linux-gnu/libboost_atomic.so;general;/usr/lib/x86_64-linux-gnu/libpthread.so;general;/usr/lib/x86_64-linux-gnu/libconsole_bridge.so;general;/opt/ros/kinetic/lib/libkinect2_registration.so;general;opencv_calib3d;general;opencv_core;general;opencv_dnn;general;opencv_features2d;general;opencv_flann;general;opencv_highgui;general;opencv_imgcodecs;general;opencv_imgproc;general;opencv_ml;general;opencv_objdetect;general;opencv_photo;general;opencv_shape;general;opencv_stitching;general;opencv_superres;general;opencv_video;general;opencv_videoio;general;opencv_videostab;general;opencv_viz;general;opencv_aruco;general;opencv_bgsegm;general;opencv_bioinspired;general;opencv_ccalib;general;opencv_cvv;general;opencv_datasets;general;opencv_dpm;general;opencv_face;general;opencv_fuzzy;general;opencv_hdf;general;opencv_img_hash;general;opencv_line_descriptor;general;opencv_optflow;general;opencv_phase_unwrapping;general;opencv_plot;general;opencv_reg;general;opencv_rgbd;general;opencv_saliency;general;opencv_stereo;general;opencv_structured_light;general;opencv_surface_matching;general;opencv_text;general;opencv_tracking;general;opencv_xfeatures2d;general;opencv_ximgproc;general;opencv_xobjdetect;general;opencv_xphoto;general;/opt/ros/kinetic/lib/libfreenect2.so; 13:27:16 13:27:16 //The directory containing a CMake configuration file for kinect2_registration. 13:27:16 kinect2_registration_DIR:PATH=/opt/ros/kinetic/share/kinect2_registration/cmake 13:27:16 13:27:16 //Path to a library. 13:27:16 lib:FILEPATH=/opt/ros/kinetic/lib/libkinect2_registration.so 13:27:16 13:27:16 //The directory containing a CMake configuration file for message_filters. 13:27:16 message_filters_DIR:PATH=/opt/ros/kinetic/share/message_filters/cmake 13:27:16 13:27:16 //The directory containing a CMake configuration file for message_generation. 13:27:16 message_generation_DIR:PATH=/opt/ros/kinetic/share/message_generation/cmake 13:27:16 13:27:16 //The directory containing a CMake configuration file for message_runtime. 13:27:16 message_runtime_DIR:PATH=/opt/ros/kinetic/share/message_runtime/cmake 13:27:16 13:27:16 //The directory containing a CMake configuration file for nodelet. 13:27:16 nodelet_DIR:PATH=/opt/ros/kinetic/share/nodelet/cmake 13:27:16 13:27:16 //The directory containing a CMake configuration file for pluginlib. 13:27:16 pluginlib_DIR:PATH=/opt/ros/kinetic/share/pluginlib/cmake 13:27:16 13:27:16 //The directory containing a CMake configuration file for rosconsole. 13:27:16 rosconsole_DIR:PATH=/opt/ros/kinetic/share/rosconsole/cmake 13:27:16 13:27:16 //The directory containing a CMake configuration file for roscpp. 13:27:16 roscpp_DIR:PATH=/opt/ros/kinetic/share/roscpp/cmake 13:27:16 13:27:16 //The directory containing a CMake configuration file for roscpp_serialization. 13:27:16 roscpp_serialization_DIR:PATH=/opt/ros/kinetic/share/roscpp_serialization/cmake 13:27:16 13:27:16 //The directory containing a CMake configuration file for roscpp_traits. 13:27:16 roscpp_traits_DIR:PATH=/opt/ros/kinetic/share/roscpp_traits/cmake 13:27:16 13:27:16 //The directory containing a CMake configuration file for rosgraph. 13:27:16 rosgraph_DIR:PATH=/opt/ros/kinetic/share/rosgraph/cmake 13:27:16 13:27:16 //The directory containing a CMake configuration file for rosgraph_msgs. 13:27:16 rosgraph_msgs_DIR:PATH=/opt/ros/kinetic/share/rosgraph_msgs/cmake 13:27:16 13:27:16 //The directory containing a CMake configuration file for roslib. 13:27:16 roslib_DIR:PATH=/opt/ros/kinetic/share/roslib/cmake 13:27:16 13:27:16 //The directory containing a CMake configuration file for rospack. 13:27:16 rospack_DIR:PATH=/opt/ros/kinetic/share/rospack/cmake 13:27:16 13:27:16 //The directory containing a CMake configuration file for rospy. 13:27:16 rospy_DIR:PATH=/opt/ros/kinetic/share/rospy/cmake 13:27:16 13:27:16 //The directory containing a CMake configuration file for rostime. 13:27:16 rostime_DIR:PATH=/opt/ros/kinetic/share/rostime/cmake 13:27:16 13:27:16 //The directory containing a CMake configuration file for sensor_msgs. 13:27:16 sensor_msgs_DIR:PATH=/opt/ros/kinetic/share/sensor_msgs/cmake 13:27:16 13:27:16 //The directory containing a CMake configuration file for smclib. 13:27:16 smclib_DIR:PATH=/opt/ros/kinetic/share/smclib/cmake 13:27:16 13:27:16 //The directory containing a CMake configuration file for std_msgs. 13:27:16 std_msgs_DIR:PATH=/opt/ros/kinetic/share/std_msgs/cmake 13:27:16 13:27:16 //The directory containing a CMake configuration file for tf2. 13:27:16 tf2_DIR:PATH=/opt/ros/kinetic/share/tf2/cmake 13:27:16 13:27:16 //The directory containing a CMake configuration file for tf2_msgs. 13:27:16 tf2_msgs_DIR:PATH=/opt/ros/kinetic/share/tf2_msgs/cmake 13:27:16 13:27:16 //The directory containing a CMake configuration file for tf2_py. 13:27:16 tf2_py_DIR:PATH=/opt/ros/kinetic/share/tf2_py/cmake 13:27:16 13:27:16 //The directory containing a CMake configuration file for tf2_ros. 13:27:16 tf2_ros_DIR:PATH=/opt/ros/kinetic/share/tf2_ros/cmake 13:27:16 13:27:16 //The directory containing a CMake configuration file for tf. 13:27:16 tf_DIR:PATH=/opt/ros/kinetic/share/tf/cmake 13:27:16 13:27:16 //The directory containing a CMake configuration file for xmlrpcpp. 13:27:16 xmlrpcpp_DIR:PATH=/opt/ros/kinetic/share/xmlrpcpp/cmake 13:27:16 13:27:16 13:27:16 ######################## 13:27:16 # INTERNAL cache entries 13:27:16 ######################## 13:27:16 13:27:16 //catkin environment 13:27:16 CATKIN_ENV:INTERNAL=/tmp/binarydeb/ros-kinetic-kinect2-bridge-0.0.8/obj-x86_64-linux-gnu/catkin_generated/env_cached.sh 13:27:16 CATKIN_TEST_RESULTS_DIR:INTERNAL=/tmp/binarydeb/ros-kinetic-kinect2-bridge-0.0.8/obj-x86_64-linux-gnu/test_results 13:27:16 //ADVANCED property for variable: CMAKE_AR 13:27:16 CMAKE_AR-ADVANCED:INTERNAL=1 13:27:16 //This is the directory where this CMakeCache.txt was created 13:27:16 CMAKE_CACHEFILE_DIR:INTERNAL=/tmp/binarydeb/ros-kinetic-kinect2-bridge-0.0.8/obj-x86_64-linux-gnu 13:27:16 //Major version of cmake used to create the current loaded cache 13:27:16 CMAKE_CACHE_MAJOR_VERSION:INTERNAL=3 13:27:16 //Minor version of cmake used to create the current loaded cache 13:27:16 CMAKE_CACHE_MINOR_VERSION:INTERNAL=5 13:27:16 //Patch version of cmake used to create the current loaded cache 13:27:16 CMAKE_CACHE_PATCH_VERSION:INTERNAL=1 13:27:16 //ADVANCED property for variable: CMAKE_COLOR_MAKEFILE 13:27:16 CMAKE_COLOR_MAKEFILE-ADVANCED:INTERNAL=1 13:27:16 //Path to CMake executable. 13:27:16 CMAKE_COMMAND:INTERNAL=/usr/bin/cmake 13:27:16 //Path to cpack program executable. 13:27:16 CMAKE_CPACK_COMMAND:INTERNAL=/usr/bin/cpack 13:27:16 //Path to ctest program executable. 13:27:16 CMAKE_CTEST_COMMAND:INTERNAL=/usr/bin/ctest 13:27:16 //ADVANCED property for variable: CMAKE_CXX_COMPILER 13:27:16 CMAKE_CXX_COMPILER-ADVANCED:INTERNAL=1 13:27:16 //ADVANCED property for variable: CMAKE_CXX_FLAGS 13:27:16 CMAKE_CXX_FLAGS-ADVANCED:INTERNAL=1 13:27:16 //ADVANCED property for variable: CMAKE_CXX_FLAGS_DEBUG 13:27:16 CMAKE_CXX_FLAGS_DEBUG-ADVANCED:INTERNAL=1 13:27:16 //ADVANCED property for variable: CMAKE_CXX_FLAGS_MINSIZEREL 13:27:16 CMAKE_CXX_FLAGS_MINSIZEREL-ADVANCED:INTERNAL=1 13:27:16 //ADVANCED property for variable: CMAKE_CXX_FLAGS_RELEASE 13:27:16 CMAKE_CXX_FLAGS_RELEASE-ADVANCED:INTERNAL=1 13:27:16 //ADVANCED property for variable: CMAKE_CXX_FLAGS_RELWITHDEBINFO 13:27:16 CMAKE_CXX_FLAGS_RELWITHDEBINFO-ADVANCED:INTERNAL=1 13:27:16 //ADVANCED property for variable: CMAKE_C_COMPILER 13:27:16 CMAKE_C_COMPILER-ADVANCED:INTERNAL=1 13:27:16 //ADVANCED property for variable: CMAKE_C_FLAGS 13:27:16 CMAKE_C_FLAGS-ADVANCED:INTERNAL=1 13:27:16 //ADVANCED property for variable: CMAKE_C_FLAGS_DEBUG 13:27:16 CMAKE_C_FLAGS_DEBUG-ADVANCED:INTERNAL=1 13:27:16 //ADVANCED property for variable: CMAKE_C_FLAGS_MINSIZEREL 13:27:16 CMAKE_C_FLAGS_MINSIZEREL-ADVANCED:INTERNAL=1 13:27:16 //ADVANCED property for variable: CMAKE_C_FLAGS_RELEASE 13:27:16 CMAKE_C_FLAGS_RELEASE-ADVANCED:INTERNAL=1 13:27:16 //ADVANCED property for variable: CMAKE_C_FLAGS_RELWITHDEBINFO 13:27:16 CMAKE_C_FLAGS_RELWITHDEBINFO-ADVANCED:INTERNAL=1 13:27:16 //Executable file format 13:27:16 CMAKE_EXECUTABLE_FORMAT:INTERNAL=ELF 13:27:16 //ADVANCED property for variable: CMAKE_EXE_LINKER_FLAGS 13:27:16 CMAKE_EXE_LINKER_FLAGS-ADVANCED:INTERNAL=1 13:27:16 //ADVANCED property for variable: CMAKE_EXE_LINKER_FLAGS_DEBUG 13:27:16 CMAKE_EXE_LINKER_FLAGS_DEBUG-ADVANCED:INTERNAL=1 13:27:16 //ADVANCED property for variable: CMAKE_EXE_LINKER_FLAGS_MINSIZEREL 13:27:16 CMAKE_EXE_LINKER_FLAGS_MINSIZEREL-ADVANCED:INTERNAL=1 13:27:16 //ADVANCED property for variable: CMAKE_EXE_LINKER_FLAGS_RELEASE 13:27:16 CMAKE_EXE_LINKER_FLAGS_RELEASE-ADVANCED:INTERNAL=1 13:27:16 //ADVANCED property for variable: CMAKE_EXE_LINKER_FLAGS_RELWITHDEBINFO 13:27:16 CMAKE_EXE_LINKER_FLAGS_RELWITHDEBINFO-ADVANCED:INTERNAL=1 13:27:16 //ADVANCED property for variable: CMAKE_EXPORT_COMPILE_COMMANDS 13:27:16 CMAKE_EXPORT_COMPILE_COMMANDS-ADVANCED:INTERNAL=1 13:27:16 //Name of external makefile project generator. 13:27:16 CMAKE_EXTRA_GENERATOR:INTERNAL= 13:27:16 //Name of generator. 13:27:16 CMAKE_GENERATOR:INTERNAL=Unix Makefiles 13:27:16 //Name of generator platform. 13:27:16 CMAKE_GENERATOR_PLATFORM:INTERNAL= 13:27:16 //Name of generator toolset. 13:27:16 CMAKE_GENERATOR_TOOLSET:INTERNAL= 13:27:16 //Have symbol pthread_create 13:27:16 CMAKE_HAVE_LIBC_CREATE:INTERNAL= 13:27:16 //Have library pthreads 13:27:16 CMAKE_HAVE_PTHREADS_CREATE:INTERNAL= 13:27:16 //Have library pthread 13:27:16 CMAKE_HAVE_PTHREAD_CREATE:INTERNAL=1 13:27:16 //Have include pthread.h 13:27:16 CMAKE_HAVE_PTHREAD_H:INTERNAL=1 13:27:16 //Source directory with the top level CMakeLists.txt file for this 13:27:16 // project 13:27:16 CMAKE_HOME_DIRECTORY:INTERNAL=/tmp/binarydeb/ros-kinetic-kinect2-bridge-0.0.8 13:27:16 //Install .so files without execute permission. 13:27:16 CMAKE_INSTALL_SO_NO_EXE:INTERNAL=1 13:27:16 //ADVANCED property for variable: CMAKE_LINKER 13:27:16 CMAKE_LINKER-ADVANCED:INTERNAL=1 13:27:16 //ADVANCED property for variable: CMAKE_MAKE_PROGRAM 13:27:16 CMAKE_MAKE_PROGRAM-ADVANCED:INTERNAL=1 13:27:16 //ADVANCED property for variable: CMAKE_MODULE_LINKER_FLAGS 13:27:16 CMAKE_MODULE_LINKER_FLAGS-ADVANCED:INTERNAL=1 13:27:16 //ADVANCED property for variable: CMAKE_MODULE_LINKER_FLAGS_DEBUG 13:27:16 CMAKE_MODULE_LINKER_FLAGS_DEBUG-ADVANCED:INTERNAL=1 13:27:16 //ADVANCED property for variable: CMAKE_MODULE_LINKER_FLAGS_MINSIZEREL 13:27:16 CMAKE_MODULE_LINKER_FLAGS_MINSIZEREL-ADVANCED:INTERNAL=1 13:27:16 //ADVANCED property for variable: CMAKE_MODULE_LINKER_FLAGS_RELEASE 13:27:16 CMAKE_MODULE_LINKER_FLAGS_RELEASE-ADVANCED:INTERNAL=1 13:27:16 //ADVANCED property for variable: CMAKE_MODULE_LINKER_FLAGS_RELWITHDEBINFO 13:27:16 CMAKE_MODULE_LINKER_FLAGS_RELWITHDEBINFO-ADVANCED:INTERNAL=1 13:27:16 //ADVANCED property for variable: CMAKE_NM 13:27:16 CMAKE_NM-ADVANCED:INTERNAL=1 13:27:16 //number of local generators 13:27:16 CMAKE_NUMBER_OF_MAKEFILES:INTERNAL=3 13:27:16 //ADVANCED property for variable: CMAKE_OBJCOPY 13:27:16 CMAKE_OBJCOPY-ADVANCED:INTERNAL=1 13:27:16 //ADVANCED property for variable: CMAKE_OBJDUMP 13:27:16 CMAKE_OBJDUMP-ADVANCED:INTERNAL=1 13:27:16 //ADVANCED property for variable: CMAKE_RANLIB 13:27:16 CMAKE_RANLIB-ADVANCED:INTERNAL=1 13:27:16 //Path to CMake installation. 13:27:16 CMAKE_ROOT:INTERNAL=/usr/share/cmake-3.5 13:27:16 //ADVANCED property for variable: CMAKE_SHARED_LINKER_FLAGS 13:27:16 CMAKE_SHARED_LINKER_FLAGS-ADVANCED:INTERNAL=1 13:27:16 //ADVANCED property for variable: CMAKE_SHARED_LINKER_FLAGS_DEBUG 13:27:16 CMAKE_SHARED_LINKER_FLAGS_DEBUG-ADVANCED:INTERNAL=1 13:27:16 //ADVANCED property for variable: CMAKE_SHARED_LINKER_FLAGS_MINSIZEREL 13:27:16 CMAKE_SHARED_LINKER_FLAGS_MINSIZEREL-ADVANCED:INTERNAL=1 13:27:16 //ADVANCED property for variable: CMAKE_SHARED_LINKER_FLAGS_RELEASE 13:27:16 CMAKE_SHARED_LINKER_FLAGS_RELEASE-ADVANCED:INTERNAL=1 13:27:16 //ADVANCED property for variable: CMAKE_SHARED_LINKER_FLAGS_RELWITHDEBINFO 13:27:16 CMAKE_SHARED_LINKER_FLAGS_RELWITHDEBINFO-ADVANCED:INTERNAL=1 13:27:16 //ADVANCED property for variable: CMAKE_SKIP_INSTALL_RPATH 13:27:16 CMAKE_SKIP_INSTALL_RPATH-ADVANCED:INTERNAL=1 13:27:16 //ADVANCED property for variable: CMAKE_SKIP_RPATH 13:27:16 CMAKE_SKIP_RPATH-ADVANCED:INTERNAL=1 13:27:16 //ADVANCED property for variable: CMAKE_STATIC_LINKER_FLAGS 13:27:16 CMAKE_STATIC_LINKER_FLAGS-ADVANCED:INTERNAL=1 13:27:16 //ADVANCED property for variable: CMAKE_STATIC_LINKER_FLAGS_DEBUG 13:27:16 CMAKE_STATIC_LINKER_FLAGS_DEBUG-ADVANCED:INTERNAL=1 13:27:16 //ADVANCED property for variable: CMAKE_STATIC_LINKER_FLAGS_MINSIZEREL 13:27:16 CMAKE_STATIC_LINKER_FLAGS_MINSIZEREL-ADVANCED:INTERNAL=1 13:27:16 //ADVANCED property for variable: CMAKE_STATIC_LINKER_FLAGS_RELEASE 13:27:16 CMAKE_STATIC_LINKER_FLAGS_RELEASE-ADVANCED:INTERNAL=1 13:27:16 //ADVANCED property for variable: CMAKE_STATIC_LINKER_FLAGS_RELWITHDEBINFO 13:27:16 CMAKE_STATIC_LINKER_FLAGS_RELWITHDEBINFO-ADVANCED:INTERNAL=1 13:27:16 //ADVANCED property for variable: CMAKE_STRIP 13:27:16 CMAKE_STRIP-ADVANCED:INTERNAL=1 13:27:16 //uname command 13:27:16 CMAKE_UNAME:INTERNAL=/bin/uname 13:27:16 //ADVANCED property for variable: CMAKE_VERBOSE_MAKEFILE 13:27:16 CMAKE_VERBOSE_MAKEFILE-ADVANCED:INTERNAL=1 13:27:16 //Test COMPILER_SUPPORTS_CXX0X 13:27:16 COMPILER_SUPPORTS_CXX0X:INTERNAL=1 13:27:16 //Test COMPILER_SUPPORTS_CXX11 13:27:16 COMPILER_SUPPORTS_CXX11:INTERNAL=1 13:27:16 //Details about finding OpenCV 13:27:16 FIND_PACKAGE_MESSAGE_DETAILS_OpenCV:INTERNAL=[/opt/ros/kinetic][v3.3.1()] 13:27:16 //Details about finding PythonInterp 13:27:16 FIND_PACKAGE_MESSAGE_DETAILS_PythonInterp:INTERNAL=[/usr/bin/python][v2.7.12()] 13:27:16 //Details about finding Threads 13:27:16 FIND_PACKAGE_MESSAGE_DETAILS_Threads:INTERNAL=[TRUE][v()] 13:27:16 GMOCK_FROM_SOURCE_FOUND:INTERNAL=TRUE 13:27:16 GMOCK_FROM_SOURCE_INCLUDE_DIRS:INTERNAL=/usr/include 13:27:16 GMOCK_FROM_SOURCE_LIBRARIES:INTERNAL=gmock 13:27:16 GMOCK_FROM_SOURCE_LIBRARY_DIRS:INTERNAL=/tmp/binarydeb/ros-kinetic-kinect2-bridge-0.0.8/obj-x86_64-linux-gnu/gmock 13:27:16 GMOCK_FROM_SOURCE_MAIN_LIBRARIES:INTERNAL=gmock_main 13:27:16 GTEST_FROM_SOURCE_FOUND:INTERNAL=TRUE 13:27:16 GTEST_FROM_SOURCE_INCLUDE_DIRS:INTERNAL=/usr/include 13:27:16 GTEST_FROM_SOURCE_LIBRARIES:INTERNAL=gtest 13:27:16 GTEST_FROM_SOURCE_LIBRARY_DIRS:INTERNAL=/tmp/binarydeb/ros-kinetic-kinect2-bridge-0.0.8/obj-x86_64-linux-gnu/gtest 13:27:16 GTEST_FROM_SOURCE_MAIN_LIBRARIES:INTERNAL=gtest_main 13:27:16 //ADVANCED property for variable: GTEST_INCLUDE_DIR 13:27:16 GTEST_INCLUDE_DIR-ADVANCED:INTERNAL=1 13:27:16 //ADVANCED property for variable: GTEST_LIBRARY 13:27:16 GTEST_LIBRARY-ADVANCED:INTERNAL=1 13:27:16 //ADVANCED property for variable: GTEST_LIBRARY_DEBUG 13:27:16 GTEST_LIBRARY_DEBUG-ADVANCED:INTERNAL=1 13:27:16 //ADVANCED property for variable: GTEST_MAIN_LIBRARY 13:27:16 GTEST_MAIN_LIBRARY-ADVANCED:INTERNAL=1 13:27:16 //ADVANCED property for variable: GTEST_MAIN_LIBRARY_DEBUG 13:27:16 GTEST_MAIN_LIBRARY_DEBUG-ADVANCED:INTERNAL=1 13:27:16 //ADVANCED property for variable: PYTHON_EXECUTABLE 13:27:16 PYTHON_EXECUTABLE-ADVANCED:INTERNAL=1 13:27:16 //This needs to be in PYTHONPATH when 'setup.py install' is called. 13:27:16 // And it needs to match. But setuptools won't tell us where 13:27:16 // it will install things. 13:27:16 PYTHON_INSTALL_DIR:INTERNAL=lib/python2.7/dist-packages 13:27:16 13:27:16 cd /tmp/binarydeb/ros-kinetic-kinect2-bridge-0.0.8 13:27:16 debian/rules:25: recipe for target 'override_dh_auto_configure' failed 13:27:16 make[1]: Leaving directory '/tmp/binarydeb/ros-kinetic-kinect2-bridge-0.0.8' 13:27:16 debian/rules:22: recipe for target 'build' failed 13:27:16 dh_auto_configure: cmake .. -DCMAKE_INSTALL_PREFIX=/usr -DCMAKE_VERBOSE_MAKEFILE=ON -DCMAKE_BUILD_TYPE=None -DCMAKE_INSTALL_SYSCONFDIR=/etc -DCMAKE_INSTALL_LOCALSTATEDIR=/var -DCATKIN_BUILD_BINARY_PACKAGE=1 -DCMAKE_INSTALL_PREFIX=/opt/ros/kinetic -DCMAKE_PREFIX_PATH=/opt/ros/kinetic returned exit code 1 13:27:16 make[1]: *** [override_dh_auto_configure] Error 255 13:27:16 make: *** [build] Error 2 13:27:16 dpkg-buildpackage: error: debian/rules build gave error exit status 2 13:27:16 E: Building failed 13:27:16 Traceback (most recent call last): 13:27:16 File "/tmp/ros_buildfarm/ros_buildfarm/binarydeb_job.py", line 133, in build_binarydeb 13:27:16 subprocess.check_call(cmd, cwd=source_dir) 13:27:16 File "/usr/lib/python3.5/subprocess.py", line 581, in check_call 13:27:16 raise CalledProcessError(retcode, cmd) 13:27:16 subprocess.CalledProcessError: Command '['apt-src', 'build', 'ros-kinetic-kinect2-bridge']' returned non-zero exit status 1 13:27:16 # END SUBSECTION
13:27:16 13:27:16 -------------------------------------------------------------------------------------------------- 13:27:16 `apt-src build ros-kinetic-kinect2-bridge` failed. 13:27:16 This is usually because of an error building the package. 13:27:16 The traceback from this failure (just above) is printed for completeness, but you can ignore it. 13:27:16 You should look above `E: Building failed` in the build log for the actual cause of the failure. 13:27:16 -------------------------------------------------------------------------------------------------- 13:27:16 13:27:16 Build step 'Execute shell' marked build as failure 13:27:16 $ ssh-agent -k 13:27:16 unset SSH_AUTH_SOCK; 13:27:16 unset SSH_AGENT_PID; 13:27:16 echo Agent pid 9171 killed; 13:27:16 [ssh-agent] Stopped. 13:27:17 [description-setter] Could not determine description. 13:27:17 Sending e-mails to: lcas-build-farm@googlegroups.com mfernandezcarmona@lincoln.ac.uk 13:27:17 Warning: you have no plugins providing access control for builds, so falling back to legacy behavior of permitting any downstream builds to be triggered 13:27:17 Finished: FAILURE